Phenol, 2-(1-methylethyl)-, methylcarbamate
- Formula: C11H15NO2
- Molecular weight: 193.2423
- IUPAC Standard InChIKey: QBSJMKIUCUGGNG-UHFFFAOYSA-N
- CAS Registry Number: 2631-40-5
- Chemical structure:
View 3d structure (requires JavaScript / HTML 5) - Other names: Carbamic acid, methyl-, o-cumenyl ester; o-Cumenyl methylcarbamate; o-Isopropylphenol methylcarbamate; o-Isopropylphenyl methylcarbamate; o-Isopropylphenyl N-methylcarbamate; Bayer 39,731; Bay 39731; Mipcin; Mipcine; MIPC; OMS 32; Phenol, o-isopropyl-, methylcarbamate; PPC 3; Ro 7-5050; 2-Isopropylphenyl methylcarbamate; 2-Isopropylphenyl N-methylcarbamate; BAY 105807; Carbamic acid, methyl-, o-isopropylphenyl ester; Etrofolan; ENT 25670; Hytox; Isoprocarb; Isopropylphenol methylcarbamate; KHE 0145; BAYER 39731; Carbamic acid, methyl-, 2-(1-methylethyl)phenyl ester; Isoprocarbe; 2-(1-Methylethyl)phenyl methylcarbamate; Mipsin; 2-(1-Methylethyl)-phenol methyl-carbamate; O-Cumenyl N-methylcarbamate; Isopropyl phenylmethyl carbamate; Methylcarbamic acid, o-cumenyl ester; N-Methyl-2-isopropylphenylcarbamate; NSC 191479

Phase change data

Data compiled as indicated in comments:
TRC - Thermodynamics Research Center, NIST Boulder Laboratories, Chris Muzny director
AC - William E. Acree, Jr., James S. Chickos
Quantity | Value | Units | Method | Reference | Comment |
---|---|---|---|---|---|
Tfus | 369.94 | K | N/A | Donnelly, Drewes, et al., 1990 | Uncertainty assigned by TRC = 0.2 K; TRC |
Enthalpy of fusion
ΔfusH (kJ/mol) | Temperature (K) | Method | Reference | Comment |
---|---|---|---|---|
26.14 | 369.3 | DSC | Donnelly, Drewes, et al., 1990, 2 | AC |

Van Den Dool and Kratz RI, non-polar column, temperature ramp

View large format table.

Column type Active phase I Reference Comment
CapillaryCBP-11481.Oyama, Sano, et al., 1987N2, 6. K/min; Column length: 12. m; Column diameter: 0.53 mm; Tstart: 120. C; Tend: 250. C

Normal alkane RI, non-polar column, temperature ramp

View large format table.

Column type Active phase I Reference Comment
CapillaryPolydimethyl siloxane1548.Hayakawa, Niinomi, et al., 199025. m/0.32 mm/0.52 μm, He, 6. K/min; Tstart: 60. C; Tend: 270. C

Normal alkane RI, non-polar column, custom temperature program

View large format table.

Column type Active phase I Reference Comment
Capillary5 % Phenyl methyl siloxane1538.Department of Food Safety and Welfare, 200630. m/0.25 mm/0.25 μm, Helium; Program: 50 0C(1 min) 25 0C/min -> 125 0C 10 0C/min -> 300 0C (10 min)
CapillaryHP-51537.Kawara, Asada, et al., 200530. m/0.25 mm/0.25 μm; Program: 50 0C (1 min) 20 0C/min -> 150 0C 10 0C/min -> 280 0C
CapillaryUltra-11493.Tameo and Kiyos, 1991Program: not specified

Normal alkane RI, polar column, custom temperature program

View large format table.

Column type Active phase I Reference Comment
CapillaryCarbowax 20M2085.Tameo and Kiyos, 1991Program: not specified

Lee's RI, non-polar column, temperature ramp

View large format table.

Column type Active phase I Reference Comment
CapillaryHP-5205.4Shao, Wang, et al., 200630. m/0.3 mm/0.25 μm, He, 50. C @ 5. min, 5. K/min, 200. C @ 15. min

References

Donnelly, Drewes, et al., 1990
Donnelly, J.R.; Drewes, L.A.; Johnson, R.L.; Munslow, W.D.; Knapp, K.K.; Sovocool, G.W.,
Purity and heat of fusion data for environmental standards as determined by differential scanning calorimetry,
Thermochim. Acta, 1990, 167, 2, 155, https://doi.org/10.1016/0040-6031(90)80476-F
. [all data]
Donnelly, Drewes, et al., 1990, 2
Donnelly, J.R.; Drewes, L.A.; Johnson, R.L.; Munslow, W.D.; Knapp, K.K.; Sovocool, G.W.,
Purity and heat of fusion data for environmental standards as determined by differential scanning calorimetry,
Thermochimica Acta, 1990, 167, 2, 155-187, https://doi.org/10.1016/0040-6031(90)80476-F
. [all data]