2-Cyclopropen-1-one,2-methyl-3-phenyl-
- Formula: C10H8O
- Molecular weight: 144.1699
- IUPAC Standard InChIKey: WVLSTTXXRJZADV-UHFFFAOYSA-N
- CAS Registry Number: 26307-30-2
- Chemical structure:
View 3d structure (requires JavaScript / HTML 5) - Permanent link for this species. Use this link for bookmarking this species for future reference.

Gas phase ion energetics data

Data compiled by: Sharon G. Lias, Rhoda D. Levin, and Sherif A. Kafafi
Ionization energy determinations
IE (eV) | Method | Reference | Comment |
---|---|---|---|
8.64 | PE | Dehmlow, Dehmlow, et al., 1977 | Vertical value |

References

Dehmlow, Dehmlow, et al., 1977
Dehmlow, E.V.; Dehmlow, S.S.; Marschner, F.,
Chemische und photoelektronenspektroskopische Eigenschaften von cyclopropylsubstituierten Cyclopropenonen,
Chem. Ber., 1977, 110, 154. [all data]