Butanal, 2-ethyl-3-methyl-
- Formula: C7H14O
- Molecular weight: 114.1855
- IUPAC Standard InChIKey: SHGPBDQRELYPLO-UHFFFAOYSA-N
- CAS Registry Number: 26254-92-2
- Chemical structure:
View 3d structure (requires JavaScript / HTML 5) - Other names: (CH3)2CHCH(C2H5)CHO; 2-Ethylisovaleraldehyde; 2-Ethyl-3-methylbutanal; 2-Ethyl-3-methylbutyraldehyde

Gas phase ion energetics data

Data compiled as indicated in comments:
LLK - Sharon G. Lias, Rhoda D. Levin, and Sherif A. Kafafi
Ionization energy determinations
IE (eV) | Method | Reference | Comment |
---|---|---|---|
9.44 | EI | Holmes, Fingas, et al., 1981 | LLK |
Appearance energy determinations
Ion | AE (eV) | Other Products | Method | Reference | Comment |
---|---|---|---|---|---|
C4H8O+ | 9.68 | C3H6 | EI | Holmes and Lossing, 1980 | LLK |

References

Holmes, Fingas, et al., 1981
Holmes, J.L.; Fingas, M.; Lossing, F.P.,
Towards a general scheme for estimating the heats of formation of organic ions in the gas phase. Part I. Odd-electron cations,
Can. J. Chem., 1981, 59, 80. [all data]
Holmes and Lossing, 1980
Holmes, J.L.; Lossing, F.P.,
Gas-phase heats of formation of keto and enol ions of carbonyl compounds.,
J. Am. Chem. Soc., 1980, 102, 1591. [all data]