1,2,3-Selenadiazole
- Formula: C2H2N2Se
- Molecular weight: 133.01
- IUPAC Standard InChIKey: BUOKUWQCVSZNCF-UHFFFAOYSA-N
- CAS Registry Number: 26223-16-5
- Chemical structure:
View 3d structure (requires JavaScript / HTML 5) - Permanent link for this species. Use this link for bookmarking this species for future reference.

Gas phase ion energetics data

Data compiled as indicated in comments:
LLK - Sharon G. Lias, Rhoda D. Levin, and Sherif A. Kafafi
Ionization energy determinations
IE (eV) | Method | Reference | Comment |
---|---|---|---|
8.9 | PE | Bock, Aygen, et al., 1980 | LLK |
9.69 | PE | Schulz and Schweig, 1980 | Vertical value; LLK |

References

Bock, Aygen, et al., 1980
Bock, H.; Aygen, S.; Rosmus, P.; Solouki, B.,
Analyse und optimierung von gasphasen-reaktionen. XVII. Selenoketen,
Chem. Ber., 1980, 113, 3187. [all data]
Schulz and Schweig, 1980
Schulz, R.; Schweig, A.,
6-Fulveneselone,
Angew. Chem. Int. Ed. Engl., 1980, 19, 69. [all data]