Dibenzo-p-dioxin
- Formula: C12H8O2
- Molecular weight: 184.1907
- IUPAC Standard InChIKey: NFBOHOGPQUYFRF-UHFFFAOYSA-N
- CAS Registry Number: 262-12-4
- Chemical structure:
View 3d structure (requires JavaScript / HTML 5) - Other names: Dibenzo[b,e][1,4]dioxin; Dibenzo[1,4]dioxin; Diphenylene dioxide; Oxanthrene; Phenodioxin; Dibenzodioxin; NCI-C03656

Gas phase thermochemistry data

Data compiled as indicated in comments:
ALS - Hussein Y. Afeefy, Joel F. Liebman, and Stephen E. Stein
DRB - Donald R. Burgess, Jr.
GT - Glushko Thermocenter, Russian Academy of Sciences, Moscow
Quantity | Value | Units | Method | Reference | Comment |
---|---|---|---|---|---|
ΔfH°gas | -59.2 ± 4.4 | kJ/mol | Ccb | Luk'yanova, Kolesov, et al., 1997 | ALS |
ΔfH°gas | -59.2 ± 4.4 | kJ/mol | Ccb | Luk'yanova, Kolesov, et al., 1997 | ALS |
ΔfH°gas | -59.2 | kJ/mol | N/A | Luk'yanova, Kolesov, et al., 1997 | Value computed using ΔfHsolid° value of -148.7±4.4 kj/mol from Luk'yanova, Kolesov, et al., 1997 and ΔsubH° value of 89.5 kj/mol from Luk'yanova, Kolesov, et al., 1997.; DRB |
Constant pressure heat capacity of gas
Cp,gas (J/mol*K) | Temperature (K) | Reference | Comment |
---|---|---|---|
45.21 | 50. | Dorofeeva O.V., 1997 | These S(T) and Cp(T) values were calculated using estimated vibrational frequencies. Thermodynamic functions calculated earlier by [ Shaub, 1982] are lower than selected ones by 8.8-11.2 J/mol*K for S(T) and 0.1-4.0 J/mol*K for Cp(T).; GT |
64.38 | 100. | ||
89.83 | 150. | ||
119.08 | 200. | ||
164.70 | 273.15 | ||
180.2 ± 3.0 | 298.15 | ||
181.38 | 300. | ||
239.19 | 400. | ||
287.19 | 500. | ||
325.45 | 600. | ||
355.90 | 700. | ||
380.43 | 800. | ||
400.49 | 900. | ||
417.09 | 1000. | ||
430.97 | 1100. | ||
442.67 | 1200. | ||
452.59 | 1300. | ||
461.06 | 1400. | ||
468.33 | 1500. |

Condensed phase thermochemistry data

Data compiled by: Hussein Y. Afeefy, Joel F. Liebman, and Stephen E. Stein
Quantity | Value | Units | Method | Reference | Comment |
---|---|---|---|---|---|
ΔfH°solid | -148.7 ± 4.4 | kJ/mol | Ccb | Luk'yanova, Kolesov, et al., 1997 | |
ΔfH°solid | -148.7 ± 4.4 | kJ/mol | Ccb | Luk'yanova, Kolesov, et al., 1997 | |
Quantity | Value | Units | Method | Reference | Comment |
ΔcH°solid | -5716.7 ± 4.1 | kJ/mol | Ccb | Luk'yanova, Kolesov, et al., 1997 | Corresponding ΔfHºsolid = -148.7 kJ/mol (simple calculation by NIST; no Washburn corrections) |
ΔcH°solid | -5716.7 ± 4.1 | kJ/mol | Ccb | Luk'yanova, Kolesov, et al., 1997 | Corresponding ΔfHºsolid = -148.7 kJ/mol (simple calculation by NIST; no Washburn corrections) |

Phase change data

Data compiled as indicated in comments:
TRC - Thermodynamics Research Center, NIST Boulder Laboratories, Chris Muzny director
AC - William E. Acree, Jr., James S. Chickos
DRB - Donald R. Burgess, Jr.
ALS - Hussein Y. Afeefy, Joel F. Liebman, and Stephen E. Stein
Quantity | Value | Units | Method | Reference | Comment |
---|---|---|---|---|---|
Tfus | 395.7 | K | N/A | Rordorf, 1986 | Uncertainty assigned by TRC = 0.1 K; TRC |
Tfus | 393.05 | K | N/A | Cullinane and Rees, 1940 | Uncertainty assigned by TRC = 0.5 K; TRC |
Quantity | Value | Units | Method | Reference | Comment |
ΔsubH° | 91.5 ± 0.8 | kJ/mol | C | Pimenova, Melkhanova, et al., 2002 | AC |
ΔsubH° | 89.6 ± 0.7 | kJ/mol | C | Kolesov, Dorofeeva, et al., 1999 | AC |
ΔsubH° | 89.5 | kJ/mol | N/A | Luk'yanova, Kolesov, et al., 1997 | DRB |
Enthalpy of sublimation
ΔsubH (kJ/mol) | Temperature (K) | Method | Reference | Comment |
---|---|---|---|---|
93.6 ± 1.2 | 318. | ME | Li, Shibata, et al., 2004 | Based on data from 303. to 333. K.; AC |
89.55 ± 0.72 | 318. | C | Luk'yanova, Kolesov, et al., 1997 | ALS |
89.55 | 318. | C | Luk'yanova, Kolesov, et al., 1997 | ALS |
89.6 ± 0.7 | 318. | C | Luk'yanova, Kolesov, et al., 1997, 2 | AC |
92.3 | 318. | T | Rordorf, 1989 | Based on data from 303. to 333. K. See also Rordorf, 1986, 2.; AC |
Enthalpy of fusion
ΔfusH (kJ/mol) | Temperature (K) | Reference | Comment |
---|---|---|---|
23.2 | 395.7 | Rordorf, 1986, 3 | AC |

Gas phase ion energetics data

Data evaluated as indicated in comments:
L - Sharon G. Lias
Data compiled as indicated in comments:
LL - Sharon G. Lias and Joel F. Liebman
LLK - Sharon G. Lias, Rhoda D. Levin, and Sherif A. Kafafi
RDSH - Henry M. Rosenstock, Keith Draxl, Bruce W. Steiner, and John T. Herron
Quantity | Value | Units | Method | Reference | Comment |
---|---|---|---|---|---|
IE (evaluated) | 7.598 ± 0.002 | eV | N/A | N/A | L |
Ionization energy determinations
IE (eV) | Method | Reference | Comment |
---|---|---|---|
7.598 ± 0.002 | LS | Zimmermann, Boesl, et al., 1995 | LL |
7.5 | PE | Colonna, Distefano, et al., 1978 | LLK |
8.10 ± 0.03 | EI | Nounou, 1966 | RDSH |
7.7 | CTS | Kuboyama, 1964 | RDSH |
7.78 ± 0.05 | PE | Colonna, Distefano, et al., 1978 | Vertical value; LLK |

Van Den Dool and Kratz RI, non-polar column, temperature ramp

Column type | Active phase | I | Reference | Comment |
---|---|---|---|---|
Capillary | RTX-5 | 1612. | Donnelly, Munslow, et al., 1991 | 30. m/0.25 mm/0.25 μm, He, 170. C @ 1. min, 2. K/min; Tend: 320. C |
Capillary | RTX-5 | 1612. | Donnelly, Munslow, et al., 1991, 2 | 30. m/0.25 mm/0.25 μm, He, 170. C @ 1. min, 2. K/min; Tend: 320. C |

Lee's RI, non-polar column, temperature ramp

Column type | Active phase | I | Reference | Comment |
---|---|---|---|---|
Capillary | SE-52 | 267.27 | Lee, Vassilaros, et al., 1979 | 12. m/0.3 mm/0.34 μm, He, 2. K/min; Tstart: 50. C; Tend: 250. C |

References

Luk'yanova, Kolesov, et al., 1997
Luk'yanova, V.A.; Kolesov, V.P.; Avramenko, N.V.; Vorob'eva, V.P.; Golovkov, V.F.,
Standard enthalpy of formation of dibenzo-p-dioxine,
Russ. J. Phys. Chem. (Engl. Transl.), 1997, 71, 338-340, In original 406. [all data]
Dorofeeva O.V., 1997
Dorofeeva O.V.,
Unpublished results. Thermocenter of Russian Academy of Science, Moscow, 1997. [all data]
Shaub, 1982
Shaub, W.M.,
Estimated thermodynamic functions for some chlorinated benzenes, phenols and dioxins,
Thermochim. Acta, 1982, 58, 11-44. [all data]
Rordorf, 1986
Rordorf, B.F.,
Proc. 5th Interna. Sympo. on Chlorinated Dioxins and Related Compounds, Bayreuth, 1986. [all data]
Cullinane and Rees, 1940
Cullinane, N.M.; Rees, W.T.,
Isomorphous relationships of some organic compounds of analogous constitution,
Trans. Faraday Soc., 1940, 36, 507. [all data]
Pimenova, Melkhanova, et al., 2002
Pimenova, S.M.; Melkhanova, S.V.; Kolesov, V.P.; Demyanov, P.I.; Fedotov, A.N.; Vorobieva, V.P.,
Experimental determination of the enthalpy of formation of dibenzo- p-dioxin,
The Journal of Chemical Thermodynamics, 2002, 34, 3, 385-390, https://doi.org/10.1006/jcht.2001.0951
. [all data]
Kolesov, Dorofeeva, et al., 1999
Kolesov, Victor P.; Dorofeeva, Olga V.; Iorish, Vladimir S.; Papina, Tatiana S.; Lukyanova, Vera A.; Melkhanova, Svetlana V.,
Experimental measurements and a group additivity approach for estimating the standard molar enthalpies of formation of dioxins,
Mendeleev Communications, 1999, 9, 4, 143-144, https://doi.org/10.1070/MC1999v009n04ABEH001074
. [all data]
Li, Shibata, et al., 2004
Li, Xian-Wei; Shibata, Etsuro; Kasai, Eiki; Nakamura, Takashi,
VAPOR PRESSURES AND ENTHALPIES OF SUBLIMATION OF 17 POLYCHLORINATED DIBENZO-p-DIOXINS AND FIVE POLYCHLORINATED DIBENZOFURANS,
Environ Toxicol Chem, 2004, 23, 2, 348-808, https://doi.org/10.1897/03-193
. [all data]
Luk'yanova, Kolesov, et al., 1997, 2
Luk'yanova, V.A.; Kolesov, V.P.; Avramenko, N.V.; Vorob'eva, V.P.; Golovkov, V.F.,
Standard enthalpy of formation of dibenzo-p-dioxin,
Zh. Fiz. Khim., 1997, 71, 3, 406. [all data]
Rordorf, 1989
Rordorf, Berchtold F.,
Prediction of vapor pressures, boiling points and enthalpies of fusion for twenty-nine halogenated dibenzo-p-dioxins and fifty-five dibenzofurans by a vapor pressure correlation method,
Chemosphere, 1989, 18, 1-6, 783-788, https://doi.org/10.1016/0045-6535(89)90196-3
. [all data]
Rordorf, 1986, 2
Rordorf, Berchtold F.,
Thermal properties of dioxins, furans and related compounds,
Chemosphere, 1986, 15, 9-12, 1325-1332, https://doi.org/10.1016/0045-6535(86)90407-8
. [all data]
Rordorf, 1986, 3
Rordorf, B.F.,
, Proceedings of the Fifth International Symposium on Chlorinated Dioxins and Related Compounds (16-19 September), Bayreuth, Germany, 1986. [all data]
Zimmermann, Boesl, et al., 1995
Zimmermann, R.; Boesl, U.; Lenoir, D.; Kettrup, A.; Grebner, T.L.; Neusser, H.J.,
The ionization energies of polychlorinated dibenzo-p-dioxins: new experimental results and theoretical studies,
Int. J. Mass Spectrom. Ion Processes, 1995, 145, 97. [all data]
Colonna, Distefano, et al., 1978
Colonna, F.P.; Distefano, G.; Galasso, V.; Irgolic, K.J.; King, C.E.; Pappalardo, G.C.,
The conformation, uv-absorption spectra and photoelectron spectra of phenoxachalcogenins,
J. Organometal. Chem., 1978, 146, 235. [all data]
Nounou, 1966
Nounou, P.,
Etude des composes aromatiques par spectrometrie de masse. I. Mesure des potentials d'ionisation et d'apparition par la methode du potential retardateur et interpretation des courbes d'ionisation differentielle,
J. Chim. Phys., 1966, 63, 994. [all data]
Kuboyama, 1964
Kuboyama, A.,
Molecular complexes and their spectra. XVII.The iodine and the chloranil complexes with thianthrene analogs,
J. Am. Chem. Soc., 1964, 86, 164. [all data]
Donnelly, Munslow, et al., 1991
Donnelly, J.R.; Munslow, W.D.; Grange, A.H.; Pettit, T.L.; Simmons, R.D.; Sovocool, G.W.,
Correlation of structure with linear retention index for bromo- and bromochlorodibenzo-p-dioxins and bromodibenzofurans,
J. Chromatogr., 1991, 540, 293-310, https://doi.org/10.1016/S0021-9673(01)88817-8
. [all data]
Donnelly, Munslow, et al., 1991, 2
Donnelly, J.R.; Munslow, W.D.; Grange, A.H.; Pettit, T.L.; Simmons, R.D.; Kumar, K.S.; Sovocool, G.W.,
A gas chromatographic/mass spectrometric approach for isomer-specific environmental monitoring of the 1700 bromo-, chloro-, and bromoschloro-dibenzo-p-dioxins,
Biol. Mass Spectrom., 1991, 20, 5, 329-337, https://doi.org/10.1002/bms.1200200515
. [all data]
Lee, Vassilaros, et al., 1979
Lee, M.L.; Vassilaros, D.L.; White, C.M.; Novotny, M.,
Retention Indices for Programmed-Temperature Capillary-Column Gas Chromatography of Polycyclic Aromatic Hydrocarbons,
Anal. Chem., 1979, 51, 6, 768-773, https://doi.org/10.1021/ac50042a043
. [all data]