Silane,1H-indene-1,2-diylbis[trimethyl-
- Formula: C15H24Si2
- Molecular weight: 260.5221
- IUPAC Standard InChIKey: RCHVAAMUFAYMOD-UHFFFAOYSA-N
- CAS Registry Number: 26205-36-7
- Chemical structure:
View 3d structure (requires JavaScript / HTML 5) - Permanent link for this species. Use this link for bookmarking this species for future reference.

Gas phase ion energetics data

Data compiled by: Sharon G. Lias, Rhoda D. Levin, and Sherif A. Kafafi
Ionization energy determinations
IE (eV) | Method | Reference |
---|---|---|
7.54 ± 0.01 | EI | Rakita, Hoffman, et al., 1973 |

References

Rakita, Hoffman, et al., 1973
Rakita, P.E.; Hoffman, M.K.; Andrews, M.N.; Bursey, M.M.,
σ-π Conjugation in group IVA compounds of indene and indane,
J. Organomet. Chem., 1973, 49, 213. [all data]