1-Tridecyne
- Formula: C13H24
- Molecular weight: 180.3297
- IUPAC Standard InChIKey: GZEDKDBFUBPZNG-UHFFFAOYSA-N
- CAS Registry Number: 26186-02-7
- Chemical structure:
View 3d structure (requires JavaScript / HTML 5) - Other names: 1-C13H24; tridec-1-yne

Phase change data

Data compiled as indicated in comments:
BS - Robert L. Brown and Stephen E. Stein
TRC - Thermodynamics Research Center, NIST Boulder Laboratories, Chris Muzny director
Quantity | Value | Units | Method | Reference | Comment |
---|---|---|---|---|---|
Tfus | 274. | K | N/A | Lumb and Smith, 1952 | Uncertainty assigned by TRC = 3. K; TRC |
Reduced pressure boiling point
Tboil (K) | Pressure (bar) | Reference | Comment |
---|---|---|---|
367.6 | 0.033 | Farchan Laboratories, 1990 | BS |

Gas phase ion energetics data

Data compiled as indicated in comments:
LLK - Sharon G. Lias, Rhoda D. Levin, and Sherif A. Kafafi
Ionization energy determinations
IE (eV) | Method | Reference | Comment |
---|---|---|---|
9.90 ± 0.02 | PI | Rang and Martinson, 1978 | LLK |

Kovats' RI, non-polar column, isothermal

Column type | Active phase | Temperature (C) | I | Reference | Comment |
---|---|---|---|---|---|
Capillary | Squalane | 80. | 1283. | Soják, Farkas, et al., 1991 | 107. m/0.25 mm/0.40 μm, H2 |
Capillary | OV-101 | 110. | 1313. | Kuningas, Rang, et al., 1990 | He; Column length: 50. m; Column diameter: 0.25 mm |
Capillary | Apiezon L | 150. | 1296. | Rang, Kuningas, et al., 1976 | N2; Column length: 50. m; Column diameter: 0.25 mm |
Capillary | Apiezon L | 170. | 1297. | Rang, Kuningas, et al., 1976 | N2; Column length: 50. m; Column diameter: 0.25 mm |
Capillary | Apiezon L | 190. | 1298. | Rang, Kuningas, et al., 1976 | N2; Column length: 50. m; Column diameter: 0.25 mm |

Kovats' RI, polar column, isothermal

Column type | Active phase | Temperature (C) | I | Reference | Comment |
---|---|---|---|---|---|
Capillary | PEG 4000 | 110. | 1533. | Rang, Orav, et al., 1988 | |
Capillary | PEG 4000 | 120. | 1533. | Rang, Orav, et al., 1988 | |
Capillary | PEG 4000 | 140. | 1533. | Rang, Orav, et al., 1988 | |
Capillary | PEG 4000 | 150. | 1532. | Rang, Orav, et al., 1988 | |
Capillary | PEG 4000 | 160. | 1533. | Rang, Orav, et al., 1988 | |
Capillary | PEG-20M | 70. | 1503.8 | Orav, Kuningas, et al., 1985 | Column length: 100. m; Column diameter: 0.25 mm |
Capillary | PEG-20M | 70. | 1526.1 | Orav, Kuningas, et al., 1985 | Column length: 100. m; Column diameter: 0.25 mm |
Capillary | PEG-20M | 80. | 1506.7 | Orav, Kuningas, et al., 1985 | Column length: 100. m; Column diameter: 0.25 mm |
Capillary | PEG-20M | 80. | 1527.2 | Orav, Kuningas, et al., 1985 | Column length: 100. m; Column diameter: 0.25 mm |

References

Lumb and Smith, 1952
Lumb; Smith, J.O.,
J. Chem. Soc., 1952, 1952, 5032. [all data]
Farchan Laboratories, 1990
Farchan Laboratories,
Research Chemicals Catalog, Farchan Laboratories, Gainesville, FL, 1990, 91. [all data]
Rang and Martinson, 1978
Rang, S.; Martinson, E.,
Ionization potentials of unsaturated hydrocarbons. 3. n-Alkyunes C8-C12.,
Eesti. NSV Tead. Akad. Toim. Keem., 1978, 44. [all data]
Soják, Farkas, et al., 1991
Soják, L.; Farkas, P.; Ostrovský, I.; Janák, J.; Chrétien, J.R.,
Capillary gas chromatography of C5 - C13 branched alkynes on squalane and liquid crystal stationary phases,
J. Chromatogr., 1991, 557, 241-253, https://doi.org/10.1016/S0021-9673(01)87136-3
. [all data]
Kuningas, Rang, et al., 1990
Kuningas, K.; Rang, S.; Kailas, T.,
Relationship between the structure and retention of n-alkenes and n-alkynes on silicone phases,
J. Chromatogr., 1990, 520, 137-148, https://doi.org/10.1016/0021-9673(90)85094-C
. [all data]
Rang, Kuningas, et al., 1976
Rang, S.; Kuningas, K.; Orav, A.; Eisen, O.,
Capillary gas chromatography of n-alkynes. I. Retention indices,
J. Chromatogr., 1976, 119, 451-460, https://doi.org/10.1016/S0021-9673(00)86807-7
. [all data]
Rang, Orav, et al., 1988
Rang, S.A.; Orav, A.E.; Kuningas, K.R.; Meister, A.E.; Strense, T.V.; Eisen, O.G.,
Gas-Chromatographic Characteristics of unsaturated hydrocarbons, Academy of Sciences of Estonia SSR, Tallinn, Estonia SSR, 1988, 208. [all data]
Orav, Kuningas, et al., 1985
Orav, A.; Kuningas, K.; Rang, S.; Eisen, O.,
Capillary gas chromatography of n-tridecenes, n-tetradecenes and C10-C14 n-alkynes on polyethylene glycol 20m of different polarity,
Eesti NSV Tead. Akad. Toim. Keem., 1985, 34, 2, 105-113. [all data]