1,2-Diazacyclohex-4-ene, 1,2-dimethyl-
- Formula: C6H12N2
- Molecular weight: 112.1729
- IUPAC Standard InChIKey: YTOCHSMFDSTIKM-UHFFFAOYSA-N
- CAS Registry Number: 26163-36-0
- Chemical structure:
View 3d structure (requires JavaScript / HTML 5) - Permanent link for this species. Use this link for bookmarking this species for future reference.

Gas phase ion energetics data

Data compiled as indicated in comments:
LBLHLM - Sharon G. Lias, John E. Bartmess, Joel F. Liebman, John L. Holmes, Rhoda D. Levin, and W. Gary Mallard
LLK - Sharon G. Lias, Rhoda D. Levin, and Sherif A. Kafafi
Ionization energy determinations
IE (eV) | Method | Reference | Comment |
---|---|---|---|
6.87 ± 0.05 | EQ | Rumack, 1986 | LBLHLM |
8.89 | PE | Rademacher and Koopman, 1975 | Vertical value; LLK |
8.89 | PE | Rademacher, 1974 | Vertical value; LLK |
8.12 | PE | Nelsen and Buschek, 1974 | Vertical value; LLK |

References

Rumack, 1986
Rumack, D.,
Title unavailable,
Personal communication to S.G. Lias, 1986. [all data]
Rademacher and Koopman, 1975
Rademacher, P.; Koopman, H.,
Cyclische und bicyclische Hydrazine,
Chem. Ber., 1975, 108, 1557. [all data]
Rademacher, 1974
Rademacher, P.,
Photoelectron spectra and conformation of cyclic N,N'-dimethylhydrazines,
Tetrahedron Lett., 1974, 83. [all data]
Nelsen and Buschek, 1974
Nelsen, S.F.; Buschek, J.M.,
Photoelectron spectra of hydrazines. V. Pyrazolidine and hexahydropyridazine derivatives,
J. Am. Chem. Soc., 1974, 96, 6987. [all data]