1,3,5-Hexatriene, (Z)-
- Formula: C6H8
- Molecular weight: 80.1277
- IUPAC Standard InChIKey: AFVDZBIIBXWASR-WAYWQWQTSA-N
- CAS Registry Number: 2612-46-6
- Chemical structure:
View 3d structure (requires JavaScript / HTML 5) - Stereoisomers:
- Other names: (Z)-1,3,5-Hexatriene; cis-Hexatriene; cis-1,3,5-Hexatriene; 1,3,5-Hexatriene, cis-; (Z)-CH2=CHCH=CHCH=CH2

Gas phase thermochemistry data

Data compiled as indicated in comments:
ALS - Hussein Y. Afeefy, Joel F. Liebman, and Stephen E. Stein
GT - Glushko Thermocenter, Russian Academy of Sciences, Moscow
Quantity | Value | Units | Method | Reference | Comment |
---|---|---|---|---|---|
ΔfH°gas | 172. ± 3. | kJ/mol | Chyd | Fang and Rogers, 1992 | ALS |
Constant pressure heat capacity of gas
Cp,gas (J/mol*K) | Temperature (K) | Reference | Comment |
---|---|---|---|
41.29 | 50. | Thermodynamics Research Center, 1997 | GT |
55.27 | 100. | ||
67.54 | 150. | ||
80.58 | 200. | ||
102.34 | 273.15 | ||
110.17 | 298.15 | ||
110.75 | 300. | ||
141.09 | 400. | ||
167.34 | 500. | ||
189.07 | 600. | ||
207.09 | 700. | ||
222.26 | 800. | ||
235.18 | 900. | ||
246.26 | 1000. | ||
255.81 | 1100. | ||
264.05 | 1200. | ||
271.19 | 1300. | ||
277.39 | 1400. | ||
282.77 | 1500. |

Phase change data

Data compiled as indicated in comments:
BS - Robert L. Brown and Stephen E. Stein
TRC - Thermodynamics Research Center, NIST Boulder Laboratories, Chris Muzny director
AC - William E. Acree, Jr., James S. Chickos
Quantity | Value | Units | Method | Reference | Comment |
---|---|---|---|---|---|
Tboil | 351.2 | K | N/A | Weast and Grasselli, 1989 | BS |
Tboil | 356. | K | N/A | Sondheimer, Ben-Efraim, et al., 1961 | Uncertainty assigned by TRC = 3. K; TRC |
Tboil | 356. | K | N/A | Hwa, De Benneville, et al., 1960 | Uncertainty assigned by TRC = 2. K; TRC |
Tboil | 352. | K | N/A | Farmer, Laroiz, et al., 1927 | Uncertainty assigned by TRC = 10. K; TRC |
Enthalpy of vaporization
ΔvapH (kJ/mol) | Temperature (K) | Method | Reference | Comment |
---|---|---|---|---|
33.3 | 314. | A,MM | Stephenson and Malanowski, 1987 | Based on data from 306. to 323. K. See also Letcher and Marsicano, 1974.; AC |

Reaction thermochemistry data

Data compiled by: Hussein Y. Afeefy, Joel F. Liebman, and Stephen E. Stein
Individual Reactions
By formula: 3H2 + C6H8 = C6H14
Quantity | Value | Units | Method | Reference | Comment |
---|---|---|---|---|---|
ΔrH° | -339. ± 3. | kJ/mol | Chyd | Fang and Rogers, 1992 | liquid phase; solvent: Cyclohexane |
ΔrH° | -336.8 ± 1.4 | kJ/mol | Chyd | Turner, Mallon, et al., 1973 | liquid phase; solvent: Glacial acetic acid |

Gas phase ion energetics data

Data compiled by: Sharon G. Lias, Rhoda D. Levin, and Sherif A. Kafafi
Ionization energy determinations
IE (eV) | Method | Reference |
---|---|---|
8.31 ± 0.02 | PE | Allan, Dannacher, et al., 1980 |
8.32 ± 0.02 | PE | Bieri, Burger, et al., 1977 |
8.3 ± 0.1 | S | Gavin and Rice, 1974 |
8.32 | PE | Beez, Bieri, et al., 1973 |

References

Fang and Rogers, 1992
Fang, W.; Rogers, D.W.,
Enthalpy of hydrogenation of the hexadienes and cis- and trans-1,3,5-hexatriene,
J. Org. Chem., 1992, 57, 2294-2297. [all data]
Thermodynamics Research Center, 1997
Thermodynamics Research Center,
Selected Values of Properties of Chemical Compounds., Thermodynamics Research Center, Texas A&M University, College Station, Texas, 1997. [all data]
Weast and Grasselli, 1989
CRC Handbook of Data on Organic Compounds, 2nd Editon, Weast,R.C and Grasselli, J.G., ed(s)., CRC Press, Inc., Boca Raton, FL, 1989, 1. [all data]
Sondheimer, Ben-Efraim, et al., 1961
Sondheimer, F.; Ben-Efraim, D.A.; Wolovsky, R.,
Unsaturated Macrocyclic Compounds XVII. The Prototropic Rearrangement of Linear 1,5-Enynes to COnjugated Polyenes. The Synthesis of A Series of Vinylogs of Butadiene,
J. Am. Chem. Soc., 1961, 83, 1675-81. [all data]
Hwa, De Benneville, et al., 1960
Hwa, J.C.H.; De Benneville, P.L.; Sims, H.J.,
A New Preparation of 1,3,5-Hexatriene and the Separation of Its Geometrical Isomers,
J. Am. Chem. Soc., 1960, 82, 2537-40. [all data]
Farmer, Laroiz, et al., 1927
Farmer, E.H.; Laroiz, B.D.; Switz, T.M.; Thorpe, J.F.,
Properties of Conjugated Compounds Part III. The Bearing of Hexatriene Chemistry on the Reactive Forms of Conjugated Hydrocarbons,
J. Chem. Soc., 1927, 1927, 2937-58. [all data]
Stephenson and Malanowski, 1987
Stephenson, Richard M.; Malanowski, Stanislaw,
Handbook of the Thermodynamics of Organic Compounds, 1987, https://doi.org/10.1007/978-94-009-3173-2
. [all data]
Letcher and Marsicano, 1974
Letcher, T.M.; Marsicano, F.,
Vapour pressures and densities of some unsaturated C6 acyclic and cyclic hydrocarbons between 300 and 320 K,
The Journal of Chemical Thermodynamics, 1974, 6, 5, 509-514, https://doi.org/10.1016/0021-9614(74)90013-5
. [all data]
Turner, Mallon, et al., 1973
Turner, R.B.; Mallon, B.J.; Tichy, M.; Doering, W.v.E.; Roth, W.R.; Schroder, G.,
Heats of hydrogenation. X. Conjugative interaction in cyclic dienes and trienes,
J. Am. Chem. Soc., 1973, 95, 8605-8610. [all data]
Allan, Dannacher, et al., 1980
Allan, M.; Dannacher, J.; Maier, J.P.,
Radiative and fragmentation decay of the cations of trans- and cis 1,3,5-hexatriene of all trans-1,3,5-heptatriene in the A(π-1) states, studied by emission photoelectron-photoion coincidence spectroscopy,
J. Chem. Phys., 1980, 73, 3114. [all data]
Bieri, Burger, et al., 1977
Bieri, G.; Burger, F.; Heilbronner, E.; Maier, J.P.,
Valence ionization enrgies of hydrocarbons,
Helv. Chim. Acta, 1977, 60, 2213. [all data]
Gavin and Rice, 1974
Gavin, R.M., Jr.; Rice, S.A.,
Spectroscopic properties of polyenes. II. The vacuum ultraviolet spectra of cis- and trans-1,3,5-hexatriene,
J. Chem. Phys., 1974, 60, 3231. [all data]
Beez, Bieri, et al., 1973
Beez, M.; Bieri, G.; Bock, H.; Heilbronner, E.,
The ionization potentials of butadiene, hexatriene, andtheir methyl derivatives: evidence for through space interaction between double bond π-orbitals and non-bonded pseudo-π orbitals of methyl groups?,
Helv. Chim. Acta, 1973, 56, 1028. [all data]