Chromium, hexakis(phosphorus trifluoride)
- Formula: CrF18P6
- Molecular weight: 579.8099
- CAS Registry Number: 26117-61-3

Condensed phase thermochemistry data

Data compiled by: José A. Martinho Simões
Quantity | Value | Units | Method | Reference | Comment |
---|---|---|---|---|---|
ΔfH°solid | -6050. ± 15. | kJ/mol | Review | Martinho Simões |

Phase change data

Data compiled by: José A. Martinho Simões
Quantity | Value | Units | Method | Reference | Comment |
---|---|---|---|---|---|
ΔsubH° | 62.8 ± 8.4 | kJ/mol | HAL-HFC | Brown and Connor, 1974 |

Gas phase ion energetics data

Data compiled by: Sharon G. Lias, Rhoda D. Levin, and Sherif A. Kafafi
Ionization energy determinations
IE (eV) | Method | Reference | Comment |
---|---|---|---|
9.0 | PE | Nixon, 1973 | |
9.29 | PE | Head, Nixon, et al., 1975 | Vertical value |

Reaction thermochemistry data

Data compiled by: José A. Martinho Simões
Individual Reactions
By formula: CrF18P6 (cr) = Cr (cr) + 6F3P (g)
Quantity | Value | Units | Method | Reference | Comment |
---|---|---|---|---|---|
ΔrH° | 305. ± 13. | kJ/mol | HAL-HFC | Brown and Connor, 1974 |

Gas phase thermochemistry data

Data compiled by: José A. Martinho Simões
Quantity | Value | Units | Method | Reference | Comment |
---|---|---|---|---|---|
ΔfH°gas | -5987. ± 17. | kJ/mol | Review | Martinho Simões |

References

Martinho Simões
Martinho Simões, J.A.,
Private communication (see http://webbook.nist.gov/chemistry/om/). [all data]
Brown and Connor, 1974
Brown, D.L.S.; Connor, J.A.,
Skinner, H. A. J. Chem. Soc., Faraday Trans. I, 1974, 70, 1649. [all data]
Nixon, 1973
Nixon, J.F.,
Photoelectron spectra and bonding in metal-trifluorophosphine complexes,
J. Chem. Soc. Dalton Trans., 1973, 21, 2226. [all data]
Head, Nixon, et al., 1975
Head, R.A.; Nixon, J.F.; Sharp, G.J.; Clark, R.J.,
Photoelectron spectroscopic study of metal trifluorophosphine and hydridotrifluorophosphine complexes,
J. Chem. Soc. Dalton Trans., 1975, 2054. [all data]