Diethylditelluride
- Formula: C4H10Te2
- Molecular weight: 313.32
- IUPAC Standard InChIKey: DRAQBUIVUGPBEB-UHFFFAOYSA-N
- CAS Registry Number: 26105-63-5
- Chemical structure:
View 3d structure (requires JavaScript / HTML 5) - Permanent link for this species. Use this link for bookmarking this species for future reference.

Gas phase ion energetics data

Data compiled by: Henry M. Rosenstock, Keith Draxl, Bruce W. Steiner, and John T. Herron
Ionization energy determinations
IE (eV) | Method | Reference |
---|---|---|
9.0 ± 0.3 | EI | Bogolyubov, Grishin, et al., 1969 |
Appearance energy determinations
Ion | AE (eV) | Other Products | Method | Reference | Comment |
---|---|---|---|---|---|
C2H5Te+ | 13.0 ± 0.3 | ? | EI | Bogolyubov, Grishin, et al., 1969 | |
C2H5Te2+ | 10.9 ± 0.3 | ? | EI | Bogolyubov, Grishin, et al., 1969 | |
C2H6Te+ | 10.3 ± 0.3 | ? | EI | Bogolyubov, Grishin, et al., 1969 | |
C2H6Te2+ | 10.4 ± 0.3 | ? | EI | Bogolyubov, Grishin, et al., 1969 | |
TeH+ | 15.0 ± 0.3 | ? | EI | Bogolyubov, Grishin, et al., 1969 | |
Te2H+ | 12.8 ± 0.3 | ? | EI | Bogolyubov, Grishin, et al., 1969 | |
TeH2+ | 12.8 ± 0.3 | ? | EI | Bogolyubov, Grishin, et al., 1969 | |
Te2H2+ | 12.0 ± 0.3 | ? | EI | Bogolyubov, Grishin, et al., 1969 | |
Te+ | 14.4 ± 0.3 | ? | EI | Bogolyubov, Grishin, et al., 1969 | |
Te2+ | 13.0 ± 0.3 | ? | EI | Bogolyubov, Grishin, et al., 1969 |

References

Bogolyubov, Grishin, et al., 1969
Bogolyubov, G.M.; Grishin, N.N.; Petrov, A.A.,
Organic derivatives of group V and group VI elements. X. Mass spectra of tetraethyldistibine, diethyl diselenide, diethyl ditelluride, and the corresponding monoderivatives. Interpretation of mass-spectral intensities,
Zh. Obshch. Khim., 1969, 39, 2244, In original 2190. [all data]