Hept-3-yn-2-one
- Formula: C7H10O
- Molecular weight: 110.1537
- IUPAC Standard InChIKey: KVCFELYYDWVHQI-UHFFFAOYSA-N
- CAS Registry Number: 26059-43-8
- Chemical structure:
View 3d structure (requires JavaScript / HTML 5) - Other names: 3-Heptyne-2-one

Gas phase ion energetics data

Data compiled by: Sharon G. Lias, Rhoda D. Levin, and Sherif A. Kafafi
Ionization energy determinations
IE (eV) | Method | Reference | Comment |
---|---|---|---|
9.67 | PE | Carlier and Mouvier, 1979 | Vertical value |

References

Carlier and Mouvier, 1979
Carlier, P.; Mouvier, G.,
Etude par spectrometrie de photoelectrons de la structure electronique des ynals et des ynones conjugues,
J. Electron Spectrosc. Relat. Phenom., 1979, 17, 169. [all data]