Benzeneethanamine, 2,5-dimethoxy-α,4-dimethyl-

Gas phase ion energetics data

Data compiled as indicated in comments:
LLK - Sharon G. Lias, Rhoda D. Levin, and Sherif A. Kafafi

Ionization energy determinations

IE (eV) Method Reference Comment
7.62PEDomelsmith, Eaton, et al., 1981Vertical value; LLK
7.62 ± 0.06PEDomelsmith and Houk, 1978Vertical value; LLK

References

Domelsmith, Eaton, et al., 1981
Domelsmith, L.N.; Eaton, T.A.; Houk, K.N.; Anderson, G.M., III; Glennon, R.A.; Shulgin, A.T.; Castagnoli, N., Jr.; Kollman, P.A., Photoelectron spectra of psychotropic drugs. 6. Relationships between physical properties and pharmacological actions of amphetamine analogues, J. Med. Chem., 1981, 24, 1414. [all data]

Domelsmith and Houk, 1978
Domelsmith, L.N.; Houk, K.N., Photoelectron spectroscopic studies of hallucinogens: The use of ionization potentials in QSAR, NIDA Res. Monogr., 1978, 22, 423. [all data]