3-Fluorobenzyl radical
- Formula: C7H6F
- Molecular weight: 109.1209
- IUPAC Standard InChIKey: RWHGZUGONAFRMT-UHFFFAOYSA-N
- CAS Registry Number: 2599-73-7
- Chemical structure:
View 3d structure (requires JavaScript / HTML 5) - Permanent link for this species. Use this link for bookmarking this species for future reference.

Gas phase ion energetics data

Data evaluated as indicated in comments:
HL - Edward P. Hunter and Sharon G. Lias
Data compiled as indicated in comments:
RDSH - Henry M. Rosenstock, Keith Draxl, Bruce W. Steiner, and John T. Herron
B - John E. Bartmess
Quantity | Value | Units | Method | Reference | Comment |
---|---|---|---|---|---|
Proton affinity (review) | 836.5 | kJ/mol | N/A | Hunter and Lias, 1998 | HL |
Quantity | Value | Units | Method | Reference | Comment |
Gas basicity | 804. | kJ/mol | N/A | Hunter and Lias, 1998 | HL |
Electron affinity determinations
EA (eV) | Method | Reference | Comment |
---|---|---|---|
1.1730 ± 0.0080 | LPES | Kim, Wenthold, et al., 1999 | B |
Ionization energy determinations
IE (eV) | Method | Reference | Comment |
---|---|---|---|
8.18 ± 0.06 | EI | Harrison, Kebarle, et al., 1961 | RDSH |

Vibrational and/or electronic energy levels

Data compiled by: Marilyn E. Jacox
State: A
Energy (cm-1) |
Med. | Transition | λmin (nm) |
λmax (nm) |
References | ||
---|---|---|---|---|---|---|---|
To = 21691 | gas | A-X | 445 | 498 | Bindley, Watts, et al., 1964 | ||
Charlton and Thrush, 1986 | |||||||
Lee and Ahn, 2000 | |||||||
Vib. sym. |
No. | Approximate type of mode |
cm-1 | Med. | Method | References | |
---|---|---|---|---|---|---|---|
734 | gas | LF | Charlton and Thrush, 1986 | ||||
466 | gas | LF | Charlton and Thrush, 1986 | ||||
State: X
Vib. sym. |
No. | Approximate type of mode |
cm-1 | Med. | Method | References | |
---|---|---|---|---|---|---|---|
a' | 7(19b | C-CH2 stretch | 1599 | gas | PE EM | Kim, Wenthold, et al., 1999, 2 Lee and Ahn, 2000 | |
9(8b) | 1567 | gas | EM | Lee and Ahn, 2000 | |||
10(8a | 1557 | gas | EM | Lee and Ahn, 2000 | |||
11(19 | 1428 | gas | EM | Lee and Ahn, 2000 | |||
14(14 | 1288 | gas | EM | Lee and Ahn, 2000 | |||
16(9b | 1142 | gas | EM | Lee and Ahn, 2000 | |||
19(12 | 998 | gas | EM | Lee and Ahn, 2000 | |||
20(7b | 930 | gas | EM | Lee and Ahn, 2000 | |||
21(1) | 741 | gas | LF EM | Charlton and Thrush, 1986 Kim, Wenthold, et al., 1999, 2 Lee and Ahn, 2000 | |||
22(6a | 530 | gas | EM | Lee and Ahn, 2000 | |||
23(6b | Ring deform. | 506 | gas | EM PE | Bindley, Watts, et al., 1964 Charlton and Thrush, 1986 Kim, Wenthold, et al., 1999, 2 Lee and Ahn, 2000 | ||
24(15 | 453 | gas | EM | Lee and Ahn, 2000 | |||
Additional references: Jacox, 1998, page 369; Jacox, 2003, page 402

References

Hunter and Lias, 1998
Hunter, E.P.; Lias, S.G.,
Evaluated Gas Phase Basicities and Proton Affinities of Molecules: An Update,
J. Phys. Chem. Ref. Data, 1998, 27, 3, 413-656, https://doi.org/10.1063/1.556018
. [all data]
Kim, Wenthold, et al., 1999
Kim, J.B.; Wenthold, P.G.; Lineberger, W.C.,
Ultraviolet photoelectron spectroscopy of o-, m-, and p-halobenzyl anions,
J. Phys. Chem. A, 1999, 103, 50, 10833-10841, https://doi.org/10.1021/jp992817o
. [all data]
Harrison, Kebarle, et al., 1961
Harrison, A.G.; Kebarle, P.; Lossing, F.P.,
Free radicals by mass spectrometry. XXI. The ionization potentials of some meta and para substituted benzyl radicals,
J. Am. Chem. Soc., 1961, 83, 777. [all data]