Biphenylene
- Formula: C12H8
- Molecular weight: 152.1919
- IUPAC Standard InChIKey: IFVTZJHWGZSXFD-UHFFFAOYSA-N
- CAS Registry Number: 259-79-0
- Chemical structure:
View 3d structure (requires JavaScript / HTML 5) - Other names: Cyclobutadibenzene; Diphenylene; 1,1'-Biphenylene; Dibenzocyclobutadiene

Gas phase thermochemistry data

Data compiled as indicated in comments:
DRB - Donald R. Burgess, Jr.
ALS - Hussein Y. Afeefy, Joel F. Liebman, and Stephen E. Stein
GT - Glushko Thermocenter, Russian Academy of Sciences, Moscow
Quantity | Value | Units | Method | Reference | Comment |
---|---|---|---|---|---|
ΔfH°gas | 417.2 ± 1.9 | kJ/mol | Review | Roux, Temprado, et al., 2008 | There are sufficient literature values to make a qualified recommendation where the suggested value is in good agreement with values predicted using thermochemical cycles or from reliable estimates. In general, the evaluated uncertainty limits are on the order of (2 to 4) kJ/mol.; DRB |
ΔfH°gas | 420.4 ± 1.9 | kJ/mol | Ccb | Douslin, Scott, et al., 1976 | see Good, 1978; ALS |
ΔfH°gas | 440.0 | kJ/mol | N/A | Bedford, Carey, et al., 1962 | Value computed using ΔfHsolid° value of 353.0 kj/mol from Bedford, Carey, et al., 1962 and ΔsubH° value of 87.0 kj/mol from Douslin, Scott, et al., 1976.; DRB |
Constant pressure heat capacity of gas
Cp,gas (J/mol*K) | Temperature (K) | Reference | Comment |
---|---|---|---|
43.33 | 50. | Thermodynamics Research Center, 1997 | p=1 bar.; GT |
62.32 | 100. | ||
82.59 | 150. | ||
106.22 | 200. | ||
145.50 | 273.15 | ||
159.30 | 298.15 | ||
160.32 | 300. | ||
212.3 | 400. | ||
255.7 | 500. | ||
290.4 | 600. | ||
318.0 | 700. | ||
340.4 | 800. | ||
358.8 | 900. | ||
374.0 | 1000. | ||
386.9 | 1100. | ||
398.0 | 1200. | ||
407.0 | 1300. | ||
415.0 | 1400. | ||
422.0 | 1500. |

Condensed phase thermochemistry data

Data compiled as indicated in comments:
DRB - Donald R. Burgess, Jr.
ALS - Hussein Y. Afeefy, Joel F. Liebman, and Stephen E. Stein
Quantity | Value | Units | Method | Reference | Comment |
---|---|---|---|---|---|
ΔfH°solid | 333.4 ± 1.8 | kJ/mol | Review | Roux, Temprado, et al., 2008 | There are sufficient literature values to make a qualified recommendation where the suggested value is in good agreement with values predicted using thermochemical cycles or from reliable estimates. In general, the evaluated uncertainty limits are on the order of (2 to 4) kJ/mol.; DRB |
ΔfH°solid | 333.4 ± 1.1 | kJ/mol | Ccb | Douslin, Scott, et al., 1976 | crystal phase; see Good, 1978; ALS |
ΔfH°solid | 353. | kJ/mol | Ccb | Bedford, Carey, et al., 1962 | ALS |
Quantity | Value | Units | Method | Reference | Comment |
ΔcH°solid | -6198.85 ± 0.92 | kJ/mol | Ccb | Douslin, Scott, et al., 1976 | crystal phase; see Good, 1978; Corresponding ΔfHºsolid = 333.4 kJ/mol (simple calculation by NIST; no Washburn corrections); ALS |
ΔcH°solid | -6219. ± 3. | kJ/mol | Ccb | Bedford, Carey, et al., 1962 | Corresponding ΔfHºsolid = 353. kJ/mol (simple calculation by NIST; no Washburn corrections); ALS |
ΔcH°solid | -6198. ± 10. | kJ/mol | Ccb | Cass, Springall, et al., 1955 | Corresponding ΔfHºsolid = 333. kJ/mol (simple calculation by NIST; no Washburn corrections); ALS |

Phase change data

Data compiled as indicated in comments:
TRC - Thermodynamics Research Center, NIST Boulder Laboratories, Chris Muzny director
DRB - Donald R. Burgess, Jr.
AC - William E. Acree, Jr., James S. Chickos
ALS - Hussein Y. Afeefy, Joel F. Liebman, and Stephen E. Stein
Quantity | Value | Units | Method | Reference | Comment |
---|---|---|---|---|---|
Tfus | 384.4 | K | N/A | Yokozeki, Wilcox, et al., 1974 | Uncertainty assigned by TRC = 0.3 K; TRC |
Quantity | Value | Units | Method | Reference | Comment |
ΔsubH° | 90. ± 30. | kJ/mol | AVG | N/A | Average of 6 values; Individual data points |
Enthalpy of sublimation
ΔsubH (kJ/mol) | Temperature (K) | Method | Reference | Comment |
---|---|---|---|---|
82.7 | 383. | GS | Nass, Lenoir, et al., 1995 | Based on data from 313. to 453. K.; AC |
68.6 ± 0.8 | 295. | V | Wolf and Weghofer, 1938 | ALS |

Reaction thermochemistry data

Data compiled by: Michael M. Meot-Ner (Mautner) and Sharon G. Lias
Individual Reactions
By formula: C10H8+ + C12H8 = (C10H8+ • C12H8)
Bond type: Charge transfer bond (positive ion)
Quantity | Value | Units | Method | Reference | Comment |
---|---|---|---|---|---|
ΔrH° | 66.5 | kJ/mol | PHPMS | Meot-Ner (Mautner), 1980 | gas phase; Entropy change calculated or estimated |
Quantity | Value | Units | Method | Reference | Comment |
ΔrS° | 120. | J/mol*K | N/A | Meot-Ner (Mautner), 1980 | gas phase; Entropy change calculated or estimated |
Free energy of reaction
ΔrG° (kJ/mol) | T (K) | Method | Reference | Comment |
---|---|---|---|---|
30. | 309. | PHPMS | Meot-Ner (Mautner), 1980 | gas phase; Entropy change calculated or estimated |
By formula: C12H9+ + C12H8 = (C12H9+ • C12H8)
Bond type: Charge transfer bond (positive ion)
Quantity | Value | Units | Method | Reference | Comment |
---|---|---|---|---|---|
ΔrS° | 120. | J/mol*K | N/A | Meot-Ner (Mautner), 1980 | gas phase; Entropy change calculated or estimated |
ΔrS° | 120. | J/mol*K | PHPMS | Meot-Ner (Mautner), 1980 | gas phase |
Free energy of reaction
ΔrG° (kJ/mol) | T (K) | Method | Reference | Comment |
---|---|---|---|---|
25. | 277. | PHPMS | Meot-Ner (Mautner), 1980 | gas phase; Entropy change calculated or estimated |

Gas phase ion energetics data

Data evaluated as indicated in comments:
HL - Edward P. Hunter and Sharon G. Lias
L - Sharon G. Lias
Data compiled as indicated in comments:
MM - Michael M. Meot-Ner (Mautner)
LBLHLM - Sharon G. Lias, John E. Bartmess, Joel F. Liebman, John L. Holmes, Rhoda D. Levin, and W. Gary Mallard
LLK - Sharon G. Lias, Rhoda D. Levin, and Sherif A. Kafafi
RDSH - Henry M. Rosenstock, Keith Draxl, Bruce W. Steiner, and John T. Herron
B - John E. Bartmess
Quantity | Value | Units | Method | Reference | Comment |
---|---|---|---|---|---|
IE (evaluated) | 7.58 ± 0.03 | eV | N/A | N/A | L |
Quantity | Value | Units | Method | Reference | Comment |
Proton affinity (review) | 848.2 | kJ/mol | N/A | Hunter and Lias, 1998 | HL |
Quantity | Value | Units | Method | Reference | Comment |
Gas basicity | 819.2 | kJ/mol | N/A | Hunter and Lias, 1998 | HL |
Electron affinity determinations
EA (eV) | Method | Reference | Comment |
---|---|---|---|
0.89 ± 0.10 | CIDC | Chen and Cooks, 1995 | B |
Proton affinity at 298K
Proton affinity (kJ/mol) | Reference | Comment |
---|---|---|
845.2 | Aue, Guidoni, et al., 2000 | Experimental literature data re-evaluated by the authors using ab initio protonation entropies; MM |
Gas basicity at 298K
Gas basicity (review) (kJ/mol) | Reference | Comment |
---|---|---|
819.2 | Aue, Guidoni, et al., 2000 | Experimental literature data re-evaluated by the authors using ab initio protonation entropies; MM |
Ionization energy determinations
IE (eV) | Method | Reference | Comment |
---|---|---|---|
7.56 ± 0.05 | EQ | Mautner(Meot-Ner), 1980 | LLK |
7.61 ± 0.04 | PE | Boschi, Clar, et al., 1974 | LLK |
7.53 ± 0.05 | PE | Eland, 1972 | LLK |
7.56 ± 0.05 | PE | Eland, 1969 | RDSH |
7.61 | PE | Dewar and Tien, 1985 | Vertical value; LBLHLM |
7.60 ± 0.02 | PE | Maier and Turner, 1972 | Vertical value; LLK |

Ion clustering data

Data compiled by: Michael M. Meot-Ner (Mautner) and Sharon G. Lias
Clustering reactions
By formula: C10H8+ + C12H8 = (C10H8+ • C12H8)
Bond type: Charge transfer bond (positive ion)
Quantity | Value | Units | Method | Reference | Comment |
---|---|---|---|---|---|
ΔrH° | 66.5 | kJ/mol | PHPMS | Meot-Ner (Mautner), 1980 | gas phase; Entropy change calculated or estimated |
Quantity | Value | Units | Method | Reference | Comment |
ΔrS° | 120. | J/mol*K | N/A | Meot-Ner (Mautner), 1980 | gas phase; Entropy change calculated or estimated |
Free energy of reaction
ΔrG° (kJ/mol) | T (K) | Method | Reference | Comment |
---|---|---|---|---|
30. | 309. | PHPMS | Meot-Ner (Mautner), 1980 | gas phase; Entropy change calculated or estimated |
By formula: C12H9+ + C12H8 = (C12H9+ • C12H8)
Bond type: Charge transfer bond (positive ion)
Quantity | Value | Units | Method | Reference | Comment |
---|---|---|---|---|---|
ΔrS° | 120. | J/mol*K | N/A | Meot-Ner (Mautner), 1980 | gas phase; Entropy change calculated or estimated |
ΔrS° | 120. | J/mol*K | PHPMS | Meot-Ner (Mautner), 1980 | gas phase |
Free energy of reaction
ΔrG° (kJ/mol) | T (K) | Method | Reference | Comment |
---|---|---|---|---|
25. | 277. | PHPMS | Meot-Ner (Mautner), 1980 | gas phase; Entropy change calculated or estimated |

Lee's RI, non-polar column, temperature ramp

Data compiled by: NIST Mass Spectrometry Data Center, William E. Wallace, director

Column type CapillaryCapillaryCapillary
Active phase HP-5HP-5SPB-5
Column length (m) 30.30.30.
Carrier gas HeliumHe
Substrate
Column diameter (mm) 0.300.30.25
Phase thickness (μm) 0.250.25
Tstart (C) 50.50.40.
Tend (C) 200.200.300.
Heat rate (K/min) 5.5.4.
Initial hold (min) 5.5.2.
Final hold (min) 15.15.
I 248.9249.1249.2
ReferenceWang, Hou, et al., 2007Shao, Wang, et al., 2006Knobloch and Engewald, 1993
Comment MSDC-RI MSDC-RI MSDC-RI

References

Roux, Temprado, et al., 2008
Roux, M.V.; Temprado, M.; Chickos, J.S.; Nagano, Y.,
Critically Evaluated Thermochemical Properties of Polycyclic Aromatic Hydrocarbons,
J. Phys. Chem. Ref. Data, 2008, 37, 4, 1855-1996. [all data]
Douslin, Scott, et al., 1976
Douslin, D.R.; Scott, D.W.; Good, W.D.; Osborn, A.G.,
Thermodynamic properties of organic compounds and thermodynamic properties of fluids,
Gov. Rep. Announce. Index U.S., 1976, 76, 97. [all data]
Good, 1978
Good, W.D.,
The enthalpies of formation of some bridged-ring polynuclear aromatic hydrocarbons,
J. Chem. Thermodyn., 1978, 10, 553-558. [all data]
Bedford, Carey, et al., 1962
Bedford, A.F.; Carey, J.G.; Millar, I.T.; Mortimer, C.T.; Springall, H.D.,
Heats of combustion and molecular structure. Part VIII. Biphenylene,
J. Chem. Soc., 1962, 3895-3898. [all data]
Thermodynamics Research Center, 1997
Thermodynamics Research Center,
Selected Values of Properties of Chemical Compounds., Thermodynamics Research Center, Texas A&M University, College Station, Texas, 1997. [all data]
Cass, Springall, et al., 1955
Cass, R.C.; Springall, H.D.; Quincey, P.G.,
Heats of combustion and molecular structure. Part III. Diphenylene,
J. Chem. Soc., 1955, 1188-1190. [all data]
Yokozeki, Wilcox, et al., 1974
Yokozeki, A.; Wilcox, C.F.; Bauer, S.H.,
Biphenylene. Internuclear Distances and Their Root Mean Square Amplitudes of Vibration,
J. Am. Chem. Soc., 1974, 96, 1026. [all data]
Nass, Lenoir, et al., 1995
Nass, Karen; Lenoir, Dieter; Kettrup, Antonius,
Calculation of the Thermodynamic Properties of Polycyclic Aromatic Hydrocarbons by an Incremental Procedure,
Angew. Chem. Int. Ed. Engl., 1995, 34, 16, 1735-1736, https://doi.org/10.1002/anie.199517351
. [all data]
Wolf and Weghofer, 1938
Wolf, K.L.; Weghofer, H.,
Uber sublimationswarmen,
Z. Phys. Chem., 1938, 39, 194-208. [all data]
Meot-Ner (Mautner), 1980
Meot-Ner (Mautner), M.,
Dimer Cations of Polycyclic Aromatics: Experimental Bonding Energies and Resonance Stabilization,
J. Phys. Chem., 1980, 84, 21, 2724, https://doi.org/10.1021/j100458a012
. [all data]
Hunter and Lias, 1998
Hunter, E.P.; Lias, S.G.,
Evaluated Gas Phase Basicities and Proton Affinities of Molecules: An Update,
J. Phys. Chem. Ref. Data, 1998, 27, 3, 413-656, https://doi.org/10.1063/1.556018
. [all data]
Chen and Cooks, 1995
Chen, G.D.; Cooks, R.G.,
Electron affinities of polycyclic aromatic hydrocarbons determined by the kinetic method,
J. Mass Spectrom., 1995, 30, 8, 1167, https://doi.org/10.1002/jms.1190300814
. [all data]
Aue, Guidoni, et al., 2000
Aue, D.H.; Guidoni, M.; Betowski, L.D.,
Ab initio calculated gas-phase basicities of polynuclear aromatic hydrocarbons,
Int. J. Mass Spectrom., 2000, 201, 283. [all data]
Mautner(Meot-Ner), 1980
Mautner(Meot-Ner), M.,
Ion thermochemistry of low volatility compounds in the gas phase. 3. Polycyclic aromatics: Ionization energies, proton, and hydrogen affinities. Extrapolations to graphite,
J. Phys. Chem., 1980, 84, 2716. [all data]
Boschi, Clar, et al., 1974
Boschi, R.; Clar, E.; Schmidt, W.,
Photoelectron spectra of polynuclear aromatics. III. The effect of nonplanarity in sterically overcrowded aromatic hydrocarbons,
J. Chem. Phys., 1974, 60, 4406. [all data]
Eland, 1972
Eland, J.H.D.,
Photoelectron spectra and ionization potentials of aromatic hydrocarbons,
Int. J. Mass Spectrom. Ion Phys., 1972, 9, 214. [all data]
Eland, 1969
Eland, J.H.D.,
Photoelectron spectra of conjugated hydrocarbons and heteromolecules,
Intern. J. Mass Spectrom. Ion Phys., 1969, 2, 471. [all data]
Dewar and Tien, 1985
Dewar, M.J.S.; Tien, T.-P.,
Photoelectron spectrum of benzyne,
J. Chem. Soc., Chem. Commun., 1985, 1243. [all data]
Maier and Turner, 1972
Maier, J.P.; Turner, D.W.,
Steric inhibition of resonance studied by molecular photoelectron spectroscopy. Part I. Biphenyls,
Faraday Discuss. Chem. Soc., 1972, 54, 149. [all data]