Cyclobutane, ethenyl-
- Formula: C6H10
- Molecular weight: 82.1436
- IUPAC Standard InChIKey: SQZFVNSRRPRBQP-UHFFFAOYSA-N
- CAS Registry Number: 2597-49-1
- Chemical structure:
View 3d structure (requires JavaScript / HTML 5) - Other names: Cyclobutane, vinyl-; Ethylene, cyclobutyl-; Vinylcyclobutane; Ethenylcyclobutane

Gas phase ion energetics data

Data compiled as indicated in comments:
LLK - Sharon G. Lias, Rhoda D. Levin, and Sherif A. Kafafi
Ionization energy determinations
IE (eV) | Method | Reference | Comment |
---|---|---|---|
9.44 | PE | Bruckmann and Klessinger, 1978 | Vertical value; LLK |
9.44 | PE | Bruckmann and Klessinger, 1974 | Vertical value; LLK |

References

Bruckmann and Klessinger, 1978
Bruckmann, P.; Klessinger, M.,
Konjugative Wechselwirkungen des Cyclobutans,
Chem. Ber., 1978, 111, 944. [all data]
Bruckmann and Klessinger, 1974
Bruckmann, P.; Klessinger, M.,
Photoelektronenspektren organischer verbindungen. V. Wechselwirkung kleiner ringe mit π-systemen,
Chem. Ber., 1974, 107, 1108. [all data]