2,3-Diazabicyclo[2.2.2]oct-2-ene,2-oxide
- Formula: C6H10N2O
- Molecular weight: 126.1564
- IUPAC Standard InChIKey: SSWATBUWYKKJJN-UHFFFAOYSA-N
- CAS Registry Number: 25926-96-9
- Chemical structure:
View 3d structure (requires JavaScript / HTML 5) - Permanent link for this species. Use this link for bookmarking this species for future reference.

Phase change data

Data compiled as indicated in comments:
TRC - Thermodynamics Research Center, NIST Boulder Laboratories, Chris Muzny director
DH - Eugene S. Domalski and Elizabeth D. Hearing
Quantity | Value | Units | Method | Reference | Comment |
---|---|---|---|---|---|
Tfus | 437.9 | K | N/A | Byström, 1980 | Crystal phase 1 phase; Uncertainty assigned by TRC = 1. K; TRC |
Enthalpy of phase transition
ΔHtrs (kJ/mol) | Temperature (K) | Initial Phase | Final Phase | Reference | Comment |
---|---|---|---|---|---|
5.020 | 359.2 | crystaline, III | crystaline, II | Bystroem, 1980 | DH |
8.050 | 399.3 | crystaline, II | crystaline, I | Bystroem, 1980 | DH |
3.840 | 437.9 | crystaline, I | liquid | Bystroem, 1980 | DH |
Entropy of phase transition
ΔStrs (J/mol*K) | Temperature (K) | Initial Phase | Final Phase | Reference | Comment |
---|---|---|---|---|---|
14.0 | 359.2 | crystaline, III | crystaline, II | Bystroem, 1980 | DH |
20.2 | 399.3 | crystaline, II | crystaline, I | Bystroem, 1980 | DH |
8.77 | 437.9 | crystaline, I | liquid | Bystroem, 1980 | DH |

Gas phase ion energetics data

Data compiled as indicated in comments:
LLK - Sharon G. Lias, Rhoda D. Levin, and Sherif A. Kafafi
Ionization energy determinations
IE (eV) | Method | Reference | Comment |
---|---|---|---|
9.30 ± 0.03 | PE | Bunzli, Olsen, et al., 1977 | Vertical value; LLK |

Gas phase thermochemistry data

Data compiled by: Hussein Y. Afeefy, Joel F. Liebman, and Stephen E. Stein
Quantity | Value | Units | Method | Reference | Comment |
---|---|---|---|---|---|
ΔfH°gas | 92.4 ± 1.8 | kJ/mol | Ccb | Bystrom, 1983 |

References

Byström, 1980
Byström, Katarina,
Solid--solid phase transitions in azoxy compounds,
J. Chem. Soc., Faraday Trans. 1, 1980, 76, 0, 1986, https://doi.org/10.1039/f19807601986
. [all data]
Bystroem, 1980
Bystroem, K.,
Solid-solid phase transitions in azoxy compounds, J. Chem. Soc.,
Faraday Trans., 1980, 1 76(9), 1986-1990. [all data]
Bunzli, Olsen, et al., 1977
Bunzli, J.-C.G.; Olsen, H.; Snyder, J.P.,
Photoelectron spectra of bicyclic azo N-oxides and azo N, N'-dioxides,
J. Org. Chem., 1977, 42, 614. [all data]