Benzene, 1-ethoxy-3-methoxy-
- Formula: C9H12O2
- Molecular weight: 152.1904
- IUPAC Standard InChIKey: SHVXEVZVJAOTNM-UHFFFAOYSA-N
- CAS Registry Number: 25783-45-3
- Chemical structure:
View 3d structure (requires JavaScript / HTML 5) - Other names: 1-Ethoxy-3-methoxybenzene

Phase change data

Data compiled by: Robert L. Brown and Stephen E. Stein
Quantity | Value | Units | Method | Reference | Comment |
---|---|---|---|---|---|
Tboil | 489. | K | N/A | Buckingham and Donaghy, 1982 |

Gas phase ion energetics data

Data compiled by: Henry M. Rosenstock, Keith Draxl, Bruce W. Steiner, and John T. Herron
Ionization energy determinations
IE (eV) | Method | Reference |
---|---|---|
8.24 ± 0.15 | EI | McLafferty and Schiff, 1969 |
Appearance energy determinations
Ion | AE (eV) | Other Products | Method | Reference | Comment |
---|---|---|---|---|---|
C7H8O2+ | 10.87 ± 0.15 | C2H4 | EI | McLafferty and Schiff, 1969 |

References

Buckingham and Donaghy, 1982
Buckingham, J.; Donaghy, S.M.,
Dictionary of Organic Compounds: Fifth Edition, Chapman and Hall, New York, 1982, 1. [all data]
McLafferty and Schiff, 1969
McLafferty, F.W.; Schiff, L.J.,
The structure of [YC6H5O]+ ions in the spectra of aryl alkyl ethers,
Org. Mass Spectrom., 1969, 2, 757. [all data]