Phosphoramidous difluoride
- Formula: F2H2NP
- Molecular weight: 84.9931
- IUPAC Standard InChIKey: MAZAVXNOOKBYCU-UHFFFAOYSA-N
- CAS Registry Number: 25757-74-8
- Chemical structure:
View 3d structure (requires JavaScript / HTML 5) - Other names: (Difluorophosphino)amine; Aminodifluorophosphine

Gas phase ion energetics data

Data compiled by: Sharon G. Lias, Rhoda D. Levin, and Sherif A. Kafafi
Ionization energy determinations
IE (eV) | Method | Reference | Comment |
---|---|---|---|
10.9 ± 0.1 | PE | Arnold and Rankin, 1975 | Vertical value |
10.9 | PE | Cradock and Rankin, 1972 | Vertical value |

References

Arnold and Rankin, 1975
Arnold, D.E.J.; Rankin, D.W.H.,
Preparation and properties of bis(difluorophosphino)- and tris(difluorophosphino)-amine,
J. Chem. Soc. Dalton Trans., 1975, 889. [all data]
Cradock and Rankin, 1972
Cradock, S.; Rankin, D.W.H.,
Photoelectron spectra of PF2H some substituted difluorophosphines,
J. Chem. Soc. Faraday Trans. 2, 1972, 68, 940. [all data]