Cyclopenta(cd)pyrene, 3,4-dihydro-
- Formula: C18H10
- Molecular weight: 226.2720
- IUPAC Standard InChIKey: LEYRJZXFRUAKLV-UHFFFAOYSA-N
- CAS Registry Number: 25732-74-5
- Chemical structure:
View 3d structure (requires JavaScript / HTML 5) - Other names: Cyclopentano(cd)pyrene; 3,4-Dihydrocyclopenta(cd)pyrene; 3,4-Dimethylenepyrene; 2,3-Acepyrene

Lee's RI, non-polar column, temperature ramp

Column type | Active phase | I | Reference | Comment |
---|---|---|---|---|
Capillary | HP-5 | 389.84 | Piao, Chu, et al., 1999 | 30. m/0.25 mm/0.25 μm, 50. C @ 2. min, 4. K/min, 280. C @ 20. min |

References

Piao, Chu, et al., 1999
Piao, M.; Chu, S.; Zheng, M.; Xu, X.,
Characterization of the combustion products of polyethylene,
Chemosphere, 1999, 39, 9, 1497-1512, https://doi.org/10.1016/S0045-6535(99)00054-5
. [all data]