2-Cyclopropen-1-thione,2,3-diphenyl-
- Formula: C15H10S
- Molecular weight: 222.305
- IUPAC Standard InChIKey: QDWQPYYTOPIUBB-UHFFFAOYSA-N
- CAS Registry Number: 2570-01-6
- Chemical structure:
View 3d structure (requires JavaScript / HTML 5) - Permanent link for this species. Use this link for bookmarking this species for future reference.

Gas phase ion energetics data

Data compiled by: Sharon G. Lias, Rhoda D. Levin, and Sherif A. Kafafi
Ionization energy determinations
IE (eV) | Method | Reference | Comment |
---|---|---|---|
11.25 | PE | Muller, Schweig, et al., 1978 | Vertical value |

References

Muller, Schweig, et al., 1978
Muller, C.; Schweig, A.; Vermeer, H.,
Photoelectron spectra of 1,2-diphenylcyclopropene, 2,3-diphenylcyclopropenone, 2,3-diphenylcyclopropenethione, 2,3-diphenylthiirene and 1-oxide; cis-stilbene, An experimental verification of conjugative inductive interactions,
J. Am. Chem. Soc., 1978, 100, 8056. [all data]