Iminostilbene
- Formula: C14H11N
- Molecular weight: 193.2438
- IUPAC Standard InChIKey: LCGTWRLJTMHIQZ-UHFFFAOYSA-N
- CAS Registry Number: 256-96-2
- Chemical structure:
View 3d structure (requires JavaScript / HTML 5) - Other names: 5H-Dibenz[b,f]azepine; Dibenz(b,f)azepine; Stilbene, 2,2'-imino-; 2,2'-Iminostilbene; 2,3,6,7-Dibenzazepine; 5-Azadibenzo(a,e)cycloheptatriene; 5H-Dibenzo(b,f)azepine; NSC 123458; Carbamazepine, M/artifact (ring); o,o'-Iminostilbene

Gas phase ion energetics data

Data compiled by: Sharon G. Lias, Rhoda D. Levin, and Sherif A. Kafafi
Ionization energy determinations
IE (eV) | Method | Reference |
---|---|---|
6.78 | PE | Gusten, Klasinc, et al., 1976 |

References

Gusten, Klasinc, et al., 1976
Gusten, H.; Klasinc, L.; Toth, T.; Knop, J.V.,
Photoelectron spectroscopy of J. Heterocycl. Chem.. 5H-dibenzo(a,d) cycloheptene analogs,
J. Electron Spectrosc. Relat. Phenom., 1976, 8, 417. [all data]