Dirubidium
- Formula: Rb2
- Molecular weight: 170.9356
- IUPAC Standard InChIKey: MQZGYYYBCTXEME-UHFFFAOYSA-N
- CAS Registry Number: 25681-81-6
- Chemical structure:
View 3d structure (requires JavaScript / HTML 5) - Permanent link for this species. Use this link for bookmarking this species for future reference.

Gas phase thermochemistry data

Quantity | Value | Units | Method | Reference | Comment |
---|---|---|---|---|---|
ΔfH°gas | 113.29 | kJ/mol | Review | Chase, 1998 | Data last reviewed in December, 1983 |
Quantity | Value | Units | Method | Reference | Comment |
S°gas,1 bar | 271.05 | J/mol*K | Review | Chase, 1998 | Data last reviewed in December, 1983 |
Gas Phase Heat Capacity (Shomate Equation)
Cp° = A + B*t + C*t2 + D*t3 +
E/t2
H° − H°298.15= A*t + B*t2/2 +
C*t3/3 + D*t4/4 − E/t + F − H
S° = A*ln(t) + B*t + C*t2/2 + D*t3/3 −
E/(2*t2) + G
Cp = heat capacity (J/mol*K)
H° = standard enthalpy (kJ/mol)
S° = standard entropy (J/mol*K)
t = temperature (K) / 1000.
View plot Requires a JavaScript / HTML 5 canvas capable browser.
Temperature (K) | 298. to 1600. | 1600. to 6000. |
---|---|---|
A | 31.01172 | 23.36057 |
B | 33.14000 | -1.449995 |
C | -43.21612 | 0.283294 |
D | 13.22571 | -0.018772 |
E | 0.061000 | 14.83354 |
F | 103.1256 | 131.1956 |
G | 300.8422 | 325.0767 |
H | 113.2902 | 113.2902 |
Reference | Chase, 1998 | Chase, 1998 |
Comment | Data last reviewed in December, 1983 | Data last reviewed in December, 1983 |

Gas phase ion energetics data

Data compiled as indicated in comments:
LBLHLM - Sharon G. Lias, John E. Bartmess, Joel F. Liebman, John L. Holmes, Rhoda D. Levin, and W. Gary Mallard
B - John E. Bartmess
Electron affinity determinations
EA (eV) | Method | Reference | Comment |
---|---|---|---|
0.498 ± 0.015 | LPES | McHugh, Eaton, et al., 1989 | Vertical Detachment Energy: 0.537±0.010 eV; B |
Ionization energy determinations
IE (eV) | Method | Reference | Comment |
---|---|---|---|
3.9 ± 0.1 | PI | Kappes and Schumacher, 1985 | LBLHLM |

Constants of diatomic molecules

Data compiled by: Klaus P. Huber and Gerhard H. Herzberg
Data collected through July, 1977
Symbol | Meaning |
---|---|
State | electronic state and / or symmetry symbol |
Te | minimum electronic energy (cm-1) |
ωe | vibrational constant – first term (cm-1) |
ωexe | vibrational constant – second term (cm-1) |
ωeye | vibrational constant – third term (cm-1) |
Be | rotational constant in equilibrium position (cm-1) |
αe | rotational constant – first term (cm-1) |
γe | rotation-vibration interaction constant (cm-1) |
De | centrifugal distortion constant (cm-1) |
βe | rotational constant – first term, centrifugal force (cm-1) |
re | internuclear distance (Å) |
Trans. | observed transition(s) corresponding to electronic state |
ν00 | position of 0-0 band (units noted in table) |
State | Te | ωe | ωexe | ωeye | Be | αe | γe | De | βe | re | Trans. | ν00 |
---|---|---|---|---|---|---|---|---|---|---|---|---|
Unidentified features in the absorption spectrum of rubidium vapour at 37270 and 40590 cm-1. | ||||||||||||
↳Creek and Marr, 1968 | ||||||||||||
Diffuse absorption bands corresponding to van der Waals molecules. | ||||||||||||
↳Ny-Tsi-Ze and Shang-Yi, 1938 | ||||||||||||
D | 22777.5 | 40.42 H | 0.0745 | -0.00144 | D ← X 1 R | 22769.1 H | ||||||
↳Tsi-Ze and San-Tsiang, 1937 | ||||||||||||
C 1Πu | 20835.1 | 36.46 H | 0.124 2 | C ↔ X 1 3 R | 20824.7 H | |||||||
↳Tsi-Ze and San-Tsiang, 1937 | ||||||||||||
"Quasicontinuous" emission 16400 - 18500 cm-1. | ||||||||||||
↳Brom and Broida, 1974 | ||||||||||||
State | Te | ωe | ωexe | ωeye | Be | αe | γe | De | βe | re | Trans. | ν00 |
B 1Πu | 14662.6 | 48.05 H | 0.191 | B ↔ X 4 R | 14657.9 H | |||||||
↳Kusch, 1936 | ||||||||||||
A (1Σu+) 5 | A ↔ X | |||||||||||
↳Sorokin and Lankard, 1971; Kostin and Khodovoi, 1973; Drummond and Schlie, 1976 | ||||||||||||
X 1Σg+ | 0 | 57.31 H | 0.105 | |||||||||
Mol. beam magn. reson. 6 |

References

Chase, 1998
Chase, M.W., Jr.,
NIST-JANAF Themochemical Tables, Fourth Edition,
J. Phys. Chem. Ref. Data, Monograph 9, 1998, 1-1951. [all data]
McHugh, Eaton, et al., 1989
McHugh, K.M.; Eaton, J.G.; Lee, G.H.; Sarkas, H.W.; Kidder, L.H.; Snodgrass, J.T.; Manaa, M.R.; Bowen, K.H.,
Photoelectron Spectra of the alkali metal cluster Anions: Na-,n=2-5, K-,n=2-7, Rb-,n=2-3, and Cs-,n=2-3,
J. Chem. Phys., 1989, 91, 6, 3792, https://doi.org/10.1063/1.456861
. [all data]
Kappes and Schumacher, 1985
Kappes, M.M.; Schumacher, E.,
Generation, spectroscopic and chemical characterization of metal clusters (Mx, x < 65), a progress report,
Surf. Sci., 1985, 156, 1. [all data]
Creek and Marr, 1968
Creek, D.M.; Marr, G.V.,
Some ultraviolet cross-section measurements on molecular alkali-metal vapours,
J. Quant. Spectrosc. Radiat. Transfer, 1968, 8, 1431. [all data]
Ny-Tsi-Ze and Shang-Yi, 1938
Ny-Tsi-Ze, P.; Shang-Yi, C.,
Bandes d'absorption du rubidium et du cesium en presence des gaz etrangers,
J. Phys. Radium, 1938, 9, 5, 169-171. [all data]
Tsi-Ze and San-Tsiang, 1937
Tsi-Ze, N.; San-Tsiang, T.,
Band spectra and energy of dissociation of the rubidium molecule,
Phys. Rev., 1937, 52, 91. [all data]
Brom and Broida, 1974
Brom, J.M., Jr.; Broida, H.P.,
Laser photoluminescence and photopredissociation of Rb2,
J. Chem. Phys., 1974, 61, 982. [all data]
Kusch, 1936
Kusch, P.,
The band spectra of rubidium and of its combinations with other alkali metals,
Phys. Rev., 1936, 49, 218. [all data]
Sorokin and Lankard, 1971
Sorokin, P.P.; Lankard, J.R.,
Emission spectra of alkali-metal molecules observed with a heat-pipe discharge tube,
J. Chem. Phys., 1971, 55, 3810. [all data]
Kostin and Khodovoi, 1973
Kostin, N.N.; Khodovoi, V.A.,
Excitation kinetics of molecular vapor of alkali metals by intense optical radiation,
Bull. Acad. Sci. USSR, Phys. Ser. Engl. Transl., 1973, 37, 69, In original 2093. [all data]
Drummond and Schlie, 1976
Drummond, D.L.; Schlie, L.A.,
Spectra and kinetics of the Rb2 molecule,
J. Chem. Phys., 1976, 65, 2116. [all data]
Baumgartner, Demtroder, et al., 1970
Baumgartner, G.; Demtroder, W.; Stock, M.,
Lifetime-measurements of alkali-molecules excited by different laserlines,
Z. Phys., 1970, 232, 462. [all data]
Granneman, Klewer, et al., 1976
Granneman, E.H.A.; Klewer, M.; Nygaard, K.J.; van der Wiel, M.J.,
Two-photon ionization of Cs2, Rb2 and RbCs using an Ar-ion laser,
J. Phys. B:, 1976, 9, 865. [all data]
Feldman and Zare, 1976
Feldman, D.L.; Zare, R.N.,
Evidence for predissociation of Rb2*(C1Πu) into Rb*(2P3/2) and Rb(2S1/2),
Chem. Phys., 1976, 15, 415. [all data]
Tam and Happer, 1976
Tam, A.C.; Happer, W.,
Polarization of laser-excited fluorescent lines from 85Rb2 and 87Rb2 molecules,
J. Chem. Phys., 1976, 64, 4337. [all data]
Brooks, Anderson, et al., 1963
Brooks, R.A.; Anderson, C.H.; Ramsey, N.F.,
Rotational magnetic moments of diatomic alkalis,
Phys. Rev. Lett., 1963, 10, 441. [all data]
Logan, Cote, et al., 1952
Logan, R.A.; Cote, R.E.; Kusch, P.,
The sign of the quadrupole interaction energy in diatomic molecules,
Phys. Rev., 1952, 86, 280. [all data]
Lawrence and Edlefsen, 1929
Lawrence, E.O.; Edlefsen, N.E.,
The photo-ionization of the vapors of caesium and rubidium,
Phys. Rev., 1929, 34, 233. [all data]
Lee and Mahan, 1965
Lee, Y.-T.; Mahan, B.H.,
Photosensitized ionization of alkali-metal vapors,
J. Chem. Phys., 1965, 42, 2893. [all data]
Hudson, 1965
Hudson, R.D.,
Measurements of the molecular absorption cross section and the photoionization of sodium vapor between 1600 and 3700,
J. Chem. Phys., 1965, 43, 1790. [all data]
Collins, Curry, et al., 1976
Collins, C.B.; Curry, S.M.; Johnson, B.W.; Mirza, M.Y.; Chellehmalzadeh, M.A.; Anderson, J.A.; Popescu, D.; Popescu, I.,
Multiphoton ionization of rubidium,
Phys. Rev. A: Gen. Phys., 1976, 14, 1662. [all data]
Olson, 1969
Olson, R.E.,
Determination of the difference potential from resonant charge-exchange total cross sections: analysis of Rb+-Rb and Cs+-Cs,
Phys. Rev., 1969, 187, 153. [all data]
Bellomonte, Cavaliere, et al., 1974
Bellomonte, L.; Cavaliere, P.; Ferrante, G.,
Alkali molecular ion energies and expectation values in a model-potential treatment,
J. Chem. Phys., 1974, 61, 3225. [all data]