Dipotassium
- Formula: K2
- Molecular weight: 78.1966
- IUPAC Standard InChIKey: ZDHURYWHEBEGHO-UHFFFAOYSA-N
- CAS Registry Number: 25681-80-5
- Chemical structure:
View 3d structure (requires JavaScript / HTML 5) - Permanent link for this species. Use this link for bookmarking this species for future reference.

Reaction thermochemistry data

Data compiled by: Michael M. Meot-Ner (Mautner) and Sharon G. Lias
Individual Reactions
By formula: K8+ + K2 = (K8+ • K2)
Quantity | Value | Units | Method | Reference | Comment |
---|---|---|---|---|---|
ΔrH° | 84.9 | kJ/mol | PDiss | Brechignac, Cahuzac, et al., 1990 | gas phase |
By formula: K9+ + K2 = (K9+ • K2)
Quantity | Value | Units | Method | Reference | Comment |
---|---|---|---|---|---|
ΔrH° | 53.1 | kJ/mol | PDiss | Brechignac, Cahuzac, et al., 1990 | gas phase |
By formula: K11+ + K2 = (K11+ • K2)
Quantity | Value | Units | Method | Reference | Comment |
---|---|---|---|---|---|
ΔrH° | 65.7 | kJ/mol | PDiss | Brechignac, Cahuzac, et al., 1990 | gas phase |
By formula: K13+ + K2 = (K13+ • K2)
Quantity | Value | Units | Method | Reference | Comment |
---|---|---|---|---|---|
ΔrH° | 68.6 | kJ/mol | PDiss | Brechignac, Cahuzac, et al., 1990 | gas phase |
By formula: K3+ + K2 = (K3+ • K2)
Quantity | Value | Units | Method | Reference | Comment |
---|---|---|---|---|---|
ΔrH° | 66.5 | kJ/mol | PDiss | Brechignac, Cahuzac, et al., 1990 | gas phase |
By formula: K4+ + K2 = (K4+ • K2)
Quantity | Value | Units | Method | Reference | Comment |
---|---|---|---|---|---|
ΔrH° | 57.7 | kJ/mol | PDiss | Brechignac, Cahuzac, et al., 1990 | gas phase |
By formula: K6+ + K2 = (K6+ • K2)
Quantity | Value | Units | Method | Reference | Comment |
---|---|---|---|---|---|
ΔrH° | 79.9 | kJ/mol | PDiss | Brechignac, Cahuzac, et al., 1990 | gas phase |
By formula: K5+ + K2 = (K5+ • K2)
Quantity | Value | Units | Method | Reference | Comment |
---|---|---|---|---|---|
ΔrH° | 76.1 | kJ/mol | PDiss | Brechignac, Cahuzac, et al., 1990 | gas phase |
By formula: K7+ + K2 = (K7+ • K2)
Quantity | Value | Units | Method | Reference | Comment |
---|---|---|---|---|---|
ΔrH° | 90.8 | kJ/mol | PDiss | Brechignac, Cahuzac, et al., 1990 | gas phase |
By formula: K10+ + K2 = (K10+ • K2)
Quantity | Value | Units | Method | Reference | Comment |
---|---|---|---|---|---|
ΔrH° | 59.0 | kJ/mol | PDiss | Brechignac, Cahuzac, et al., 1990 | gas phase |
By formula: K12+ + K2 = (K12+ • K2)
Quantity | Value | Units | Method | Reference | Comment |
---|---|---|---|---|---|
ΔrH° | 68.6 | kJ/mol | PDiss | Brechignac, Cahuzac, et al., 1990 | gas phase |

Gas phase ion energetics data

Data evaluated as indicated in comments:
L - Sharon G. Lias
Data compiled as indicated in comments:
LBLHLM - Sharon G. Lias, John E. Bartmess, Joel F. Liebman, John L. Holmes, Rhoda D. Levin, and W. Gary Mallard
LLK - Sharon G. Lias, Rhoda D. Levin, and Sherif A. Kafafi
RDSH - Henry M. Rosenstock, Keith Draxl, Bruce W. Steiner, and John T. Herron
B - John E. Bartmess
Quantity | Value | Units | Method | Reference | Comment |
---|---|---|---|---|---|
IE (evaluated) | 4.062 ± 0.0015 | eV | N/A | N/A | L |
Electron affinity determinations
EA (eV) | Method | Reference | Comment |
---|---|---|---|
0.497 ± 0.012 | LPES | Eaton, Sarkas, et al., 1992 | Vertical Detachment Energy: 0.550±0.010 eV.; B |
0.493 ± 0.012 | LPES | McHugh, Eaton, et al., 1989 | Vertical Detachment Energy: 0.550±0.010 eV; B |
Ionization energy determinations
IE (eV) | Method | Reference | Comment |
---|---|---|---|
4.0637 ± 0.0002 | PI | Kappes, Radi, et al., 1985 | LBLHLM |
4.0637 ± 0.0003 | PI | Broyer, Chevaleyre, et al., 1985 | LBLHLM |
4.06075 ± 0.00015 | LS | Leutwyler, Hofmann, et al., 1981 | LLK |
4.059 ± 0.001 | LS | Herrmann, Schumacher, et al., 1978 | LLK |
4.0607 ± 0.0001 | PI | Herrmann, Schumacher, et al., 1978 | LLK |
4.05 ± 0.05 | PI | Herrmann, Schumacher, et al., 1978 | LLK |
4.059 ± 0.001 | PI | Herrmann, Leutwyler, et al., 1978 | LLK |
3.9 | EI | Zmbov, Wu, et al., 1977 | LLK |
4.0 ± 0.1 | PI | Foster, Leckenby, et al., 1969 | RDSH |
~4.1 | S | Robertson and Barrow, 1961 | RDSH |
Appearance energy determinations
Ion | AE (eV) | Other Products | Method | Reference | Comment |
---|---|---|---|---|---|
K+ | 4.85 | K | PI | Herrmann, Leutwyler, et al., 1978 | LLK |

Ion clustering data

Data compiled by: Michael M. Meot-Ner (Mautner) and Sharon G. Lias
Clustering reactions
By formula: K3+ + K2 = (K3+ • K2)
Quantity | Value | Units | Method | Reference | Comment |
---|---|---|---|---|---|
ΔrH° | 66.5 | kJ/mol | PDiss | Brechignac, Cahuzac, et al., 1990 | gas phase |
By formula: K4+ + K2 = (K4+ • K2)
Quantity | Value | Units | Method | Reference | Comment |
---|---|---|---|---|---|
ΔrH° | 57.7 | kJ/mol | PDiss | Brechignac, Cahuzac, et al., 1990 | gas phase |
By formula: K5+ + K2 = (K5+ • K2)
Quantity | Value | Units | Method | Reference | Comment |
---|---|---|---|---|---|
ΔrH° | 76.1 | kJ/mol | PDiss | Brechignac, Cahuzac, et al., 1990 | gas phase |
By formula: K6+ + K2 = (K6+ • K2)
Quantity | Value | Units | Method | Reference | Comment |
---|---|---|---|---|---|
ΔrH° | 79.9 | kJ/mol | PDiss | Brechignac, Cahuzac, et al., 1990 | gas phase |
By formula: K7+ + K2 = (K7+ • K2)
Quantity | Value | Units | Method | Reference | Comment |
---|---|---|---|---|---|
ΔrH° | 90.8 | kJ/mol | PDiss | Brechignac, Cahuzac, et al., 1990 | gas phase |
By formula: K8+ + K2 = (K8+ • K2)
Quantity | Value | Units | Method | Reference | Comment |
---|---|---|---|---|---|
ΔrH° | 84.9 | kJ/mol | PDiss | Brechignac, Cahuzac, et al., 1990 | gas phase |
By formula: K9+ + K2 = (K9+ • K2)
Quantity | Value | Units | Method | Reference | Comment |
---|---|---|---|---|---|
ΔrH° | 53.1 | kJ/mol | PDiss | Brechignac, Cahuzac, et al., 1990 | gas phase |
By formula: K10+ + K2 = (K10+ • K2)
Quantity | Value | Units | Method | Reference | Comment |
---|---|---|---|---|---|
ΔrH° | 59.0 | kJ/mol | PDiss | Brechignac, Cahuzac, et al., 1990 | gas phase |
By formula: K11+ + K2 = (K11+ • K2)
Quantity | Value | Units | Method | Reference | Comment |
---|---|---|---|---|---|
ΔrH° | 65.7 | kJ/mol | PDiss | Brechignac, Cahuzac, et al., 1990 | gas phase |
By formula: K12+ + K2 = (K12+ • K2)
Quantity | Value | Units | Method | Reference | Comment |
---|---|---|---|---|---|
ΔrH° | 68.6 | kJ/mol | PDiss | Brechignac, Cahuzac, et al., 1990 | gas phase |
By formula: K13+ + K2 = (K13+ • K2)
Quantity | Value | Units | Method | Reference | Comment |
---|---|---|---|---|---|
ΔrH° | 68.6 | kJ/mol | PDiss | Brechignac, Cahuzac, et al., 1990 | gas phase |

Gas phase thermochemistry data

Quantity | Value | Units | Method | Reference | Comment |
---|---|---|---|---|---|
ΔfH°gas | 123.68 | kJ/mol | Review | Chase, 1998 | Data last reviewed in December, 1983 |
Quantity | Value | Units | Method | Reference | Comment |
S°gas,1 bar | 249.71 | J/mol*K | Review | Chase, 1998 | Data last reviewed in December, 1983 |
Gas Phase Heat Capacity (Shomate Equation)
Cp° = A + B*t + C*t2 + D*t3 +
E/t2
H° − H°298.15= A*t + B*t2/2 +
C*t3/3 + D*t4/4 − E/t + F − H
S° = A*ln(t) + B*t + C*t2/2 + D*t3/3 −
E/(2*t2) + G
Cp = heat capacity (J/mol*K)
H° = standard enthalpy (kJ/mol)
S° = standard entropy (J/mol*K)
t = temperature (K) / 1000.
View plot Requires a JavaScript / HTML 5 canvas capable browser.
Temperature (K) | 298. to 1300. | 1300. to 6000. |
---|---|---|
A | 22.65879 | 31.01331 |
B | 53.55520 | -5.786221 |
C | -56.32668 | 1.157994 |
D | 16.00840 | -0.078852 |
E | 0.349515 | 12.42895 |
F | 116.1901 | 134.1629 |
G | 265.4874 | 307.2290 |
H | 123.6832 | 123.6832 |
Reference | Chase, 1998 | Chase, 1998 |
Comment | Data last reviewed in December, 1983 | Data last reviewed in December, 1983 |

Constants of diatomic molecules

Data compiled by: Klaus P. Huber and Gerhard H. Herzberg

Data collected through January, 1977

Symbols used in the table of constants
SymbolMeaning
State electronic state and / or symmetry symbol
Te minimum electronic energy (cm-1)
ωe vibrational constant – first term (cm-1)
ωexe vibrational constant – second term (cm-1)
ωeye vibrational constant – third term (cm-1)
Be rotational constant in equilibrium position (cm-1)
αe rotational constant – first term (cm-1)
γe rotation-vibration interaction constant (cm-1)
De centrifugal distortion constant (cm-1)
βe rotational constant – first term, centrifugal force (cm-1)
re internuclear distance (Å)
Trans. observed transition(s) corresponding to electronic state
ν00 position of 0-0 band (units noted in table)
Diatomic constants for 39K2
StateTeωeωexeωeyeBeαeγeDeβereTrans.ν00
Unidentified diffuse emission bands, 17460 - 17840 cm-1.
Rebbeck and Vaughan, 1971
Diffuse bands close to lines of the principal series of K; fragments of additional systems.
Kuhn, 1932; Chakraborti, 1937; Okuda, 1936
G 28091 64.90 1 H 0.55        G ← X R 28077 H
Yoshinaga, 1937
F 27571 62.29 1 H 0.24        F ← X R 27556 H
Yoshinaga, 1937
StateTeωeωexeωeyeBeαeγeDeβereTrans.ν00
E 26494.0 61.8 2 H 0.28        E ← X R 26478.9 H
Yoshinaga, 1937; Sinha, 1950
D 24627.7 61.60 H 0.90 3 0.0010       D ← X R 24612.3 H
Sinha, 1948
C 1Πu 22969.43 61.485 Z 0.133  0.04404 0.00011 3E-6   4.433 C ← X R 22954.20 Z
Yamamoto, 1929; Sinha, 1948; Robertson and Barrow, 1961
B 1Πu 15376.74 75.00 0.3876 4 4.366E-3 0.048763 5 0.00024  8.25E-8  4.2125 B 6 ↔ X 7 R 15368.20 Z
Loomis, 1931; Loomis and Nusbaum, 1932; Tango, Link, et al., 1968
StateTeωeωexeωeyeBeαeγeDeβereTrans.ν00
A 1Σu+ 11681.9 69.09 H 0.153  8      A ↔ X R 11670.5 H
Crane and Christy, 1930; Sorokin and Lankard, 1971
a 3Σu+Not observed; scattering calculations predict a very shallow potential minimum at ~8.7 Å.
Geittner, 1975
X 1Σg+ 0 92.021 Z 0.2829 9 -2.055E-3 0.056743 0.000165 10  8.63E-8  3.9051 11
Kusch, Millman, et al., 1939; Logan, Cote, et al., 1952; Brooks, Anderson, et al., 1963

References

Brechignac, Cahuzac, et al., 1990
Brechignac, C.; Cahuzac, P.; Carlier, F.; De Frutos, M.; Leyniger, J.,
Cohesive Energies of (K)n+ 5<n<200 from Photoevaporation Experiments,
J. Chem. Phys., 1990, 93, 10, 7449, https://doi.org/10.1063/1.459418
. [all data]
Eaton, Sarkas, et al., 1992
Eaton, J.G.; Sarkas, H.W.; Arnold, S.T.; Mchugh, K.M.; Bowen, K.H.,
Negative Ion Photoelectron Spectroscopy of the Heteronuclear Alkali-Metal Dimer and Trimer Anions - NaK-, KRb-, RbCS-, KCs-, Na2K-, and K2Cs,
Chem. Phys. Lett., 1992, 193, 1-3, 141, https://doi.org/10.1016/0009-2614(92)85697-9
. [all data]
McHugh, Eaton, et al., 1989
McHugh, K.M.; Eaton, J.G.; Lee, G.H.; Sarkas, H.W.; Kidder, L.H.; Snodgrass, J.T.; Manaa, M.R.; Bowen, K.H.,
Photoelectron Spectra of the alkali metal cluster Anions: Na-,n=2-5, K-,n=2-7, Rb-,n=2-3, and Cs-,n=2-3,
J. Chem. Phys., 1989, 91, 6, 3792, https://doi.org/10.1063/1.456861
. [all data]
Kappes, Radi, et al., 1985
Kappes, M.M.; Radi, P.; Schar, M.; Schumacher, E.,
Photoionization measurements on dialkali monohalides generated in supersonic nozzle beams,
Chem. Phys. Lett., 1985, 113, 243. [all data]
Broyer, Chevaleyre, et al., 1985
Broyer, M.; Chevaleyre, J.; Delacretaz, G.; Fayet, P.; Woste, L.,
One- and two-photon ionization of alkaline clusters,
Surf. Sci., 1985, 156, 342. [all data]
Leutwyler, Hofmann, et al., 1981
Leutwyler, S.; Hofmann, M.; Harri, H.-P.; Schumacher, E.,
The adiabatic ionization potentials of the alkali dimers Na2, NaK and K2,
Chem. Phys. Lett., 1981, 77, 257. [all data]
Herrmann, Schumacher, et al., 1978
Herrmann, A.; Schumacher, E.; Woste, L.,
Preparation and photoionization potentials of molecules of sodium, potassium and mixed atoms,
J. Chem. Phys., 1978, 68, 2327. [all data]
Herrmann, Leutwyler, et al., 1978
Herrmann, A.; Leutwyler, S.; Schumacher, E.; Woste, L.,
38. On metal-atom clusters IV. Photoionization thresholds and multiphoton ionization spectra of alkali-metal molecules,
Helv. Chim. Acta, 1978, 61, 453. [all data]
Zmbov, Wu, et al., 1977
Zmbov, K.F.; Wu, C.H.; Ihle, H.R.,
A mass spectrometric study of heteronuclear diatomic alkali metal molecules. Dissociation energies ionization potentials of NaLi, KLi, NaK,
J. Chem. Phys., 1977, 67, 4603. [all data]
Foster, Leckenby, et al., 1969
Foster, P.J.; Leckenby, R.E.; Robbins, E.J.,
The ionization potentials of clustered alkali metal atoms,
J. Phys. B:, 1969, 2, 478. [all data]
Robertson and Barrow, 1961
Robertson, E.W.; Barrow, R.F.,
Rotational analysis oi the C1πu-X1+g system of K2, and the ionisation potential of K2,
Proc. Chem. Soc., 1961, 329. [all data]