Disodium
- Formula: Na2
- Molecular weight: 45.97953856
- IUPAC Standard InChIKey: QXNVGIXVLWOKEQ-UHFFFAOYSA-N
- CAS Registry Number: 25681-79-2
- Chemical structure:
View 3d structure (requires JavaScript / HTML 5) - Permanent link for this species. Use this link for bookmarking this species for future reference.

Reaction thermochemistry data

Data compiled by: Michael M. Meot-Ner (Mautner) and Sharon G. Lias
Individual Reactions
By formula: Na7+ + Na2 = (Na7+ • Na2)
Quantity | Value | Units | Method | Reference | Comment |
---|---|---|---|---|---|
ΔrH° | 126. | kJ/mol | PDiss | Brechignac, Cahuzac, et al., 1989 | gas phase |
By formula: Na9+ + Na2 = (Na9+ • Na2)
Quantity | Value | Units | Method | Reference | Comment |
---|---|---|---|---|---|
ΔrH° | 57.7 | kJ/mol | PDiss | Brechignac, Cahuzac, et al., 1989 | gas phase |
By formula: Na11+ + Na2 = (Na11+ • Na2)
Quantity | Value | Units | Method | Reference | Comment |
---|---|---|---|---|---|
ΔrH° | 81.2 | kJ/mol | PDiss | Brechignac, Cahuzac, et al., 1989 | gas phase |
By formula: Na13+ + Na2 = (Na13+ • Na2)
Quantity | Value | Units | Method | Reference | Comment |
---|---|---|---|---|---|
ΔrH° | 78.2 | kJ/mol | PDiss | Brechignac, Cahuzac, et al., 1989 | gas phase |
By formula: Na3+ + Na2 = (Na3+ • Na2)
Quantity | Value | Units | Method | Reference | Comment |
---|---|---|---|---|---|
ΔrH° | 71.5 | kJ/mol | PDiss | Brechignac, Cahuzac, et al., 1989 | gas phase |
By formula: Na5+ + Na2 = (Na5+ • Na2)
Quantity | Value | Units | Method | Reference | Comment |
---|---|---|---|---|---|
ΔrH° | 91.6 | kJ/mol | PDiss | Brechignac, Cahuzac, et al., 1989 | gas phase |

Gas phase ion energetics data

Data evaluated as indicated in comments:
HL - Edward P. Hunter and Sharon G. Lias
L - Sharon G. Lias
Data compiled as indicated in comments:
LL - Sharon G. Lias and Joel F. Liebman
LBLHLM - Sharon G. Lias, John E. Bartmess, Joel F. Liebman, John L. Holmes, Rhoda D. Levin, and W. Gary Mallard
LLK - Sharon G. Lias, Rhoda D. Levin, and Sherif A. Kafafi
RDSH - Henry M. Rosenstock, Keith Draxl, Bruce W. Steiner, and John T. Herron
B - John E. Bartmess
Quantity | Value | Units | Method | Reference | Comment |
---|---|---|---|---|---|
IE (evaluated) | 4.892 ± 0.003 | eV | N/A | N/A | L |
Quantity | Value | Units | Method | Reference | Comment |
Proton affinity (review) | 1146.8 | kJ/mol | N/A | Hunter and Lias, 1998 | HL |
Quantity | Value | Units | Method | Reference | Comment |
Gas basicity | 1118.2 | kJ/mol | N/A | Hunter and Lias, 1998 | HL |
Electron affinity determinations
EA (eV) | Method | Reference | Comment |
---|---|---|---|
0.430 ± 0.015 | LPES | McHugh, Eaton, et al., 1989 | Vertical Detachment Energy: 0.543±0.010 eV; B |
Ionization energy determinations
IE (eV) | Method | Reference | Comment |
---|---|---|---|
4.8947 ± 0.0001 | TE | Buhler, 1990 | LL |
4.8951 ± 0.0002 | PI | Kappes, Radi, et al., 1985 | LBLHLM |
4.91 ± 0.04 | PI | Peterson, Dao, et al., 1984 | LBLHLM |
4.897 ± 0.006 | S | Martin, Chevaleyre, et al., 1982 | LBLHLM |
4.88898 ± 0.00016 | LS | Leutwyler, Hofmann, et al., 1981 | LLK |
4.934 ± 0.011 | PI | Herrmann, Schumacher, et al., 1978 | LLK |
4.866 ± 0.014 | LS | Herrmann, Schumacher, et al., 1978 | LLK |
4.866 ± 0.014 | PI | Herrmann, Leutwyler, et al., 1978 | LLK |
4.9 | EI | Zmbov, Wu, et al., 1977 | LLK |
4.8 ± 0.1 | EI | Emel'yanov, Peredvigina, et al., 1971 | LLK |
4.9 ± 0.1 | PI | Robbins, Leckenby, et al., 1967 | RDSH |
4.90 ± 0.01 | PI | Hudson, 1965 | RDSH |
~4.87 | S | Barrow, Travis, et al., 1960 | RDSH |
Appearance energy determinations
Ion | AE (eV) | Other Products | Method | Reference | Comment |
---|---|---|---|---|---|
Na+ | 5.91 ± 0.09 | Na | PI | Wagner and Isenor, 1983 | LBLHLM |

Ion clustering data

Data compiled by: Michael M. Meot-Ner (Mautner) and Sharon G. Lias
Clustering reactions
By formula: Na3+ + Na2 = (Na3+ • Na2)
Quantity | Value | Units | Method | Reference | Comment |
---|---|---|---|---|---|
ΔrH° | 71.5 | kJ/mol | PDiss | Brechignac, Cahuzac, et al., 1989 | gas phase |
By formula: Na5+ + Na2 = (Na5+ • Na2)
Quantity | Value | Units | Method | Reference | Comment |
---|---|---|---|---|---|
ΔrH° | 91.6 | kJ/mol | PDiss | Brechignac, Cahuzac, et al., 1989 | gas phase |
By formula: Na7+ + Na2 = (Na7+ • Na2)
Quantity | Value | Units | Method | Reference | Comment |
---|---|---|---|---|---|
ΔrH° | 126. | kJ/mol | PDiss | Brechignac, Cahuzac, et al., 1989 | gas phase |
By formula: Na9+ + Na2 = (Na9+ • Na2)
Quantity | Value | Units | Method | Reference | Comment |
---|---|---|---|---|---|
ΔrH° | 57.7 | kJ/mol | PDiss | Brechignac, Cahuzac, et al., 1989 | gas phase |
By formula: Na11+ + Na2 = (Na11+ • Na2)
Quantity | Value | Units | Method | Reference | Comment |
---|---|---|---|---|---|
ΔrH° | 81.2 | kJ/mol | PDiss | Brechignac, Cahuzac, et al., 1989 | gas phase |
By formula: Na13+ + Na2 = (Na13+ • Na2)
Quantity | Value | Units | Method | Reference | Comment |
---|---|---|---|---|---|
ΔrH° | 78.2 | kJ/mol | PDiss | Brechignac, Cahuzac, et al., 1989 | gas phase |

Gas phase thermochemistry data

Quantity | Value | Units | Method | Reference | Comment |
---|---|---|---|---|---|
ΔfH°gas | 142.07 | kJ/mol | Review | Chase, 1998 | Data last reviewed in December, 1983 |
Quantity | Value | Units | Method | Reference | Comment |
S°gas,1 bar | 230.25 | J/mol*K | Review | Chase, 1998 | Data last reviewed in December, 1983 |
Gas Phase Heat Capacity (Shomate Equation)
Cp° = A + B*t + C*t2 + D*t3 +
E/t2
H° − H°298.15= A*t + B*t2/2 +
C*t3/3 + D*t4/4 − E/t + F − H
S° = A*ln(t) + B*t + C*t2/2 + D*t3/3 −
E/(2*t2) + G
Cp = heat capacity (J/mol*K)
H° = standard enthalpy (kJ/mol)
S° = standard entropy (J/mol*K)
t = temperature (K) / 1000.
View plot Requires a JavaScript / HTML 5 canvas capable browser.
Temperature (K) | 298. to 1400. | 1400. to 2800. | 2800. to 6000. |
---|---|---|---|
A | 35.87178 | 93.03250 | -494.8500 |
B | 4.131470 | -44.01861 | 231.3329 |
C | 3.093311 | 7.524129 | -33.68187 |
D | -3.803303 | 0.301394 | 1.599719 |
E | 0.028058 | -18.89289 | 856.9041 |
F | 131.2655 | 76.91238 | 1237.970 |
G | 272.4780 | 307.7273 | 349.9247 |
H | 142.0702 | 142.0702 | 142.0702 |
Reference | Chase, 1998 | Chase, 1998 | Chase, 1998 |
Comment | Data last reviewed in December, 1983 | Data last reviewed in December, 1983 | Data last reviewed in December, 1983 |

Constants of diatomic molecules

Data compiled by: Klaus P. Huber and Gerhard H. Herzberg
Data collected through June, 1977
Symbol | Meaning |
---|---|
State | electronic state and / or symmetry symbol |
Te | minimum electronic energy (cm-1) |
ωe | vibrational constant – first term (cm-1) |
ωexe | vibrational constant – second term (cm-1) |
ωeye | vibrational constant – third term (cm-1) |
Be | rotational constant in equilibrium position (cm-1) |
αe | rotational constant – first term (cm-1) |
γe | rotation-vibration interaction constant (cm-1) |
De | centrifugal distortion constant (cm-1) |
βe | rotational constant – first term, centrifugal force (cm-1) |
re | internuclear distance (Å) |
Trans. | observed transition(s) corresponding to electronic state |
ν00 | position of 0-0 band (units noted in table) |
State | Te | ωe | ωexe | ωeye | Be | αe | γe | De | βe | re | Trans. | ν00 |
---|---|---|---|---|---|---|---|---|---|---|---|---|
Diffuse bands of Na2 Van der Waals molecules close to the lines of principal series of Na. | ||||||||||||
↳Kuhn, 1932; Wurm, 1932 | ||||||||||||
Several fragments of other UV emission and absorption band systems. 1 | ||||||||||||
↳Kimura and Uchida, 1932; Yoshinaga, 1937; Sinha, 1947 | ||||||||||||
E (1Πu) | 35557.0 | 106.2 H | 0.65 | E ← X R | 35530.6 H | |||||||
↳Chang, 1950; Morales, 1963 | ||||||||||||
D 1Πu | 33486.8 | 111.3 2 H | 0.48 | 3 | D ↔ X R | 33462.9 H | ||||||
↳Sinha, 1947; Chang, 1950; Barrow, Travis, et al., 1960; Morales, 1963 | ||||||||||||
State | Te | ωe | ωexe | ωeye | Be | αe | γe | De | βe | re | Trans. | ν00 |
1Σg+ | (33000) 4 | |||||||||||
↳Woerdman, 1976 | ||||||||||||
C 1Πu | 29382 | 119.33 5 H | 0.53 | 3 | C ↔ X R | 29362 H | ||||||
↳Pearse and Sinha, 1947; Sinha, 1949; Barrow, Travis, et al., 1960 | ||||||||||||
B 1Πu | 20320.02 | 124.090 Z | 0.6999 6 | 0.125277 7 | 0.0007237 7 | 3.248E-7 8 | 4.75E-8 | 3.4228 | B ↔ X 9 10 R | 20302.49 11 Z | ||
↳Loomis and Wood, 1928; Loomis and Nusbaum, 1932; Demtroder, McClintock, et al., 1969; Demtroder and Stock, 1975 | ||||||||||||
A 1Σu+ | 14680.58 | 117.323 Z | 0.3576 12 | 0.110784 13 14 | 0.0005488 15 | 3.882E-7 16 | 3.6384 | A ↔ X 17 R | 14659.80 Z | |||
↳Fredrickson, 1929; Fredrickson and Stannard, 1933; Kusch and Hessel, 1975; Kaminsky, Hawkins, et al., 1976; Kaminsky, 1977 | ||||||||||||
State | Te | ωe | ωexe | ωeye | Be | αe | γe | De | βe | re | Trans. | ν00 |
a 3Π | <14680 | (145) 18 | (0.140) 18 | |||||||||
X 1Σg+ | 0 | 159.1245 Z | 0.72547 19 | 0.154707 20 | 0.0008736 21 | 5.811E-7 22 | 3.59E-9 | 3.07887 23 |

References

Brechignac, Cahuzac, et al., 1989
Brechignac, C.; Cahuzac, P.; Leygnier, J.; Pfalum, R.; Roux, J.P.; Weiner, J.,
Stability of Alkali Cluster Ions,
Z. Phys. D: At. Mol. Clusters, 1989, 12, 1-4, 199, https://doi.org/10.1007/BF01426937
. [all data]
Hunter and Lias, 1998
Hunter, E.P.; Lias, S.G.,
Evaluated Gas Phase Basicities and Proton Affinities of Molecules: An Update,
J. Phys. Chem. Ref. Data, 1998, 27, 3, 413-656, https://doi.org/10.1063/1.556018
. [all data]
McHugh, Eaton, et al., 1989
McHugh, K.M.; Eaton, J.G.; Lee, G.H.; Sarkas, H.W.; Kidder, L.H.; Snodgrass, J.T.; Manaa, M.R.; Bowen, K.H.,
Photoelectron Spectra of the alkali metal cluster Anions: Na-,n=2-5, K-,n=2-7, Rb-,n=2-3, and Cs-,n=2-3,
J. Chem. Phys., 1989, 91, 6, 3792, https://doi.org/10.1063/1.456861
. [all data]
Buhler, 1990
Buhler, B.,
[Title unavailable], Ph. D. Thesis, Fakultat fur Physik, Universitat Freiburg, 1990. [all data]
Kappes, Radi, et al., 1985
Kappes, M.M.; Radi, P.; Schar, M.; Schumacher, E.,
Photoionization measurements on dialkali monohalides generated in supersonic nozzle beams,
Chem. Phys. Lett., 1985, 113, 243. [all data]
Peterson, Dao, et al., 1984
Peterson, K.I.; Dao, P.D.; Farley, R.W.; Castleman, A.W., Jr.,
Photoionization of sodium clusters,
J. Chem. Phys., 1984, 80, 1780. [all data]
Martin, Chevaleyre, et al., 1982
Martin, S.; Chevaleyre, J.; Valignat, S.; Perrot, J.P.; Broyer, M.; Cabaud, B.; Hoareau, A.,
Autoionizing Rydberg states of the Na2 molecule,
Chem. Phys. Lett., 1982, 87, 235. [all data]
Leutwyler, Hofmann, et al., 1981
Leutwyler, S.; Hofmann, M.; Harri, H.-P.; Schumacher, E.,
The adiabatic ionization potentials of the alkali dimers Na2, NaK and K2,
Chem. Phys. Lett., 1981, 77, 257. [all data]
Herrmann, Schumacher, et al., 1978
Herrmann, A.; Schumacher, E.; Woste, L.,
Preparation and photoionization potentials of molecules of sodium, potassium and mixed atoms,
J. Chem. Phys., 1978, 68, 2327. [all data]
Herrmann, Leutwyler, et al., 1978
Herrmann, A.; Leutwyler, S.; Schumacher, E.; Woste, L.,
38. On metal-atom clusters IV. Photoionization thresholds and multiphoton ionization spectra of alkali-metal molecules,
Helv. Chim. Acta, 1978, 61, 453. [all data]
Zmbov, Wu, et al., 1977
Zmbov, K.F.; Wu, C.H.; Ihle, H.R.,
A mass spectrometric study of heteronuclear diatomic alkali metal molecules. Dissociation energies ionization potentials of NaLi, KLi, NaK,
J. Chem. Phys., 1977, 67, 4603. [all data]
Emel'yanov, Peredvigina, et al., 1971
Emel'yanov, A.M.; Peredvigina, V.A.; Gorokhov, L.N.,
Ionization potentials of Li2 and Na2 molecules and the dissociation energy of Li2+ and Na2+ ions,
Teplofiz. Vysokikh Temperatur, 1971, 9, 190, In original 164. [all data]
Robbins, Leckenby, et al., 1967
Robbins, E.J.; Leckenby, R.E.; Willis, P.,
The ionization potentials of clustered sodium atoms,
Advan. Phys., 1967, 16, 739. [all data]
Hudson, 1965
Hudson, R.D.,
Measurements of the molecular absorption cross section and the photoionization of sodium vapor between 1600 and 3700,
J. Chem. Phys., 1965, 43, 1790. [all data]
Barrow, Travis, et al., 1960
Barrow, R.F.; Travis, N.; Wright, C.V.,
Excited electronic states of lithium and sodium molecules,
Nature, 1960, 187, 141. [all data]
Wagner and Isenor, 1983
Wagner, G.; Isenor, N.R.,
Formation and dissociation of Na2+ by ruby laser radiation,
Can. J. Phys., 1983, 61, 40. [all data]