1,2,3-Selenadiazole, 4-phenyl-
- Formula: C8H6N2Se
- Molecular weight: 209.11
- IUPAC Standard InChIKey: LEWDFWSHOZUNRZ-UHFFFAOYSA-N
- CAS Registry Number: 25660-64-4
- Chemical structure:
View 3d structure (requires JavaScript / HTML 5) - Permanent link for this species. Use this link for bookmarking this species for future reference.

Gas phase thermochemistry data

Data compiled by: Hussein Y. Afeefy, Joel F. Liebman, and Stephen E. Stein
Quantity | Value | Units | Method | Reference | Comment |
---|---|---|---|---|---|
ΔfH°gas | 452.3 ± 8.4 | kJ/mol | Ccb | Arshadi and Shabrang, 1973 |

Condensed phase thermochemistry data

Data compiled by: Hussein Y. Afeefy, Joel F. Liebman, and Stephen E. Stein
Quantity | Value | Units | Method | Reference | Comment |
---|---|---|---|---|---|
ΔfH°solid | 358. ± 8.4 | kJ/mol | Ccb | Arshadi and Shabrang, 1973 | |
Quantity | Value | Units | Method | Reference | Comment |
ΔcH°solid | -4589.8 ± 8.4 | kJ/mol | Ccb | Arshadi and Shabrang, 1973 |

Phase change data

Data compiled as indicated in comments:
AC - William E. Acree, Jr., James S. Chickos
ALS - Hussein Y. Afeefy, Joel F. Liebman, and Stephen E. Stein
Quantity | Value | Units | Method | Reference | Comment |
---|---|---|---|---|---|
ΔsubH° | 94.1 ± 0.8 | kJ/mol | GS | Arshadi and Shabrang, 1973, 2 | AC |
Enthalpy of sublimation
ΔsubH (kJ/mol) | Temperature (K) | Method | Reference | Comment |
---|---|---|---|---|
90.7 | 336. | A | Stephenson and Malanowski, 1987 | Based on data from 327. to 345. K.; AC |
91.2 ± 1.7 | 309. | ME | Arshadi, 1974 | Based on data from 275. to 343. K.; AC |
94.1 ± 0.8 | 327. | V | Arshadi and Shabrang, 1973 | ALS |

Gas phase ion energetics data

Data compiled as indicated in comments:
LLK - Sharon G. Lias, Rhoda D. Levin, and Sherif A. Kafafi
Ionization energy determinations
IE (eV) | Method | Reference | Comment |
---|---|---|---|
8.1 | PE | Bock, Aygen, et al., 1980 | LLK |
8.80 | PE | Bock, Aygen, et al., 1980 | Vertical value; LLK |

References

Arshadi and Shabrang, 1973
Arshadi, M.R.; Shabrang, M.,
Heats of combustion and formation of 4-phenyl-1,2,3-selenadiazole and dibenzyl diselenide,
J. Chem. Soc. Perkin Trans. 2, 1973, 1732-1734. [all data]
Arshadi and Shabrang, 1973, 2
Arshadi, M.R.; Shabrang, M.,
J. Chem. Soc. Perkins II, 1973, 1732. [all data]
Stephenson and Malanowski, 1987
Stephenson, Richard M.; Malanowski, Stanislaw,
Handbook of the Thermodynamics of Organic Compounds, 1987, https://doi.org/10.1007/978-94-009-3173-2
. [all data]
Arshadi, 1974
Arshadi, Mohammed R.,
Determination of heats of sublimation of organic compounds by a mass spectrometric--knudsen effusion method,
J. Chem. Soc., Faraday Trans. 1, 1974, 70, 0, 1569, https://doi.org/10.1039/f19747001569
. [all data]
Bock, Aygen, et al., 1980
Bock, H.; Aygen, S.; Rosmus, P.; Solouki, B.,
Analyse und optimierung von gasphasen-reaktionen. XVII. Selenoketen,
Chem. Ber., 1980, 113, 3187. [all data]