zirconium nitride
- Formula: NZr
- Molecular weight: 105.231
- CAS Registry Number: 25658-42-8

Condensed phase thermochemistry data

Quantity | Value | Units | Method | Reference | Comment |
---|---|---|---|---|---|
ΔfH°liquid | -290.75 | kJ/mol | Review | Chase, 1998 | Data last reviewed in June, 1961 |
Quantity | Value | Units | Method | Reference | Comment |
S°liquid,1 bar | 62.31 | J/mol*K | Review | Chase, 1998 | Data last reviewed in June, 1961 |
Quantity | Value | Units | Method | Reference | Comment |
ΔfH°solid | -365.26 | kJ/mol | Review | Chase, 1998 | Data last reviewed in June, 1961 |
Quantity | Value | Units | Method | Reference | Comment |
S°solid | 38.83 | J/mol*K | Review | Chase, 1998 | Data last reviewed in June, 1961 |
Liquid Phase Heat Capacity (Shomate Equation)
Cp° = A + B*t + C*t2 + D*t3 +
E/t2
H° − H°298.15= A*t + B*t2/2 +
C*t3/3 + D*t4/4 − E/t + F − H
S° = A*ln(t) + B*t + C*t2/2 + D*t3/3 −
E/(2*t2) + G
Cp = heat capacity (J/mol*K)
H° = standard enthalpy (kJ/mol)
S° = standard entropy (J/mol*K)
t = temperature (K) / 1000.
View plot Requires a JavaScript / HTML 5 canvas capable browser.
Temperature (K) | 3225. to 6000. |
---|---|
A | 58.57600 |
B | 1.133430×10-7 |
C | -2.223232×10-8 |
D | 1.494542×10-9 |
E | 2.479561×10-7 |
F | -316.8501 |
G | 118.2633 |
H | -290.7495 |
Reference | Chase, 1998 |
Comment | Data last reviewed in June, 1961 |
Solid Phase Heat Capacity (Shomate Equation)
Cp° = A + B*t + C*t2 + D*t3 +
E/t2
H° − H°298.15= A*t + B*t2/2 +
C*t3/3 + D*t4/4 − E/t + F − H
S° = A*ln(t) + B*t + C*t2/2 + D*t3/3 −
E/(2*t2) + G
Cp = heat capacity (J/mol*K)
H° = standard enthalpy (kJ/mol)
S° = standard entropy (J/mol*K)
t = temperature (K) / 1000.
View plot Requires a JavaScript / HTML 5 canvas capable browser.
Temperature (K) | 298. to 3225. |
---|---|
A | 46.45788 |
B | 7.006317 |
C | 0.007791 |
D | -0.000719 |
E | -0.720527 |
F | -381.8565 |
G | 88.90498 |
H | -365.2632 |
Reference | Chase, 1998 |
Comment | Data last reviewed in June, 1961 |

Gas phase ion energetics data

Data compiled as indicated in comments:
RDSH - Henry M. Rosenstock, Keith Draxl, Bruce W. Steiner, and John T. Herron
Ionization energy determinations
IE (eV) | Method | Reference | Comment |
---|---|---|---|
7.9 ± 0.4 | EI | Gingerich, 1968 | RDSH |

Gas phase thermochemistry data

Quantity | Value | Units | Method | Reference | Comment |
---|---|---|---|---|---|
ΔfH°gas | 170.50 | kcal/mol | Review | Chase, 1998 | Data last reviewed in June, 1961 |
Quantity | Value | Units | Method | Reference | Comment |
S°gas,1 bar | 55.791 | cal/mol*K | Review | Chase, 1998 | Data last reviewed in June, 1961 |

References

Chase, 1998
Chase, M.W., Jr.,
NIST-JANAF Themochemical Tables, Fourth Edition,
J. Phys. Chem. Ref. Data, Monograph 9, 1998, 1-1951. [all data]
Gingerich, 1968
Gingerich, K.A.,
Gaseous metal nitrides. II. The dissociation energy, heat of sublimation, and heat of formation of zirconium mononitride,
J. Chem. Phys., 1968, 49, 14. [all data]