Formyl chloride
- Formula: CHClO
- Molecular weight: 64.471
- IUPAC Standard InChIKey: GFAUNYMRSKVDJL-UHFFFAOYSA-N
- CAS Registry Number: 2565-30-2
- Chemical structure:
View 3d structure (requires JavaScript / HTML 5) - Permanent link for this species. Use this link for bookmarking this species for future reference.

Gas phase ion energetics data

Data compiled by: Sharon G. Lias, Rhoda D. Levin, and Sherif A. Kafafi
Ionization energy determinations
IE (eV) | Method | Reference |
---|---|---|
11.51 | PE | Frost, McDowell, et al., 1977 |

References

Frost, McDowell, et al., 1977
Frost, D.C.; McDowell, C.A.; Westwood, N.P.C.,
The photoelectron spectrum of formyl chloride,
Chem. Phys. Lett., 1977, 51, 607. [all data]