2H-Azepin-2-one, hexahydro-1-methyl-
- Formula: C7H13NO
- Molecular weight: 127.1842
- IUPAC Standard InChIKey: ZWXPDGCFMMFNRW-UHFFFAOYSA-N
- CAS Registry Number: 2556-73-2
- Chemical structure:
View 3d structure (requires JavaScript / HTML 5) - Other names: N-Methyl-ε-caprolactam; N-Methylcaprolactam; 1-Methylcaprolactam; Hexahydro-1-methyl-2H-azepin-2-one; ε-Caprolactam, N-methyl-; 2H-Azepin-2-one, hexahydro-N-methyl-; N-Methyl-e-caprolactam; NSC 68794

Condensed phase thermochemistry data

Data compiled by: Hussein Y. Afeefy, Joel F. Liebman, and Stephen E. Stein
Quantity | Value | Units | Method | Reference | Comment |
---|---|---|---|---|---|
ΔcH°liquid | -4305.8 ± 0.4 | kJ/mol | Ccb | Kozina and Skuratov, 1959 | |
ΔcH°liquid | -4304.1 | kJ/mol | Ccb | Skuratov, Kozina, et al., 1958 |

Phase change data

Data compiled as indicated in comments:
BS - Robert L. Brown and Stephen E. Stein
AC - William E. Acree, Jr., James S. Chickos
Reduced pressure boiling point
Tboil (K) | Pressure (bar) | Reference | Comment |
---|---|---|---|
380.2 | 0.008 | Aldrich Chemical Company Inc., 1990 | BS |
Enthalpy of vaporization
ΔvapH (kJ/mol) | Temperature (K) | Reference | Comment |
---|---|---|---|
49.4 | 370. | Shcherbina, Kaporovskii, et al., 1984 | Based on data from 340. to 400. K.; AC |

Gas phase ion energetics data

Data compiled as indicated in comments:
LBLHLM - Sharon G. Lias, John E. Bartmess, Joel F. Liebman, John L. Holmes, Rhoda D. Levin, and W. Gary Mallard
LLK - Sharon G. Lias, Rhoda D. Levin, and Sherif A. Kafafi
Ionization energy determinations
IE (eV) | Method | Reference | Comment |
---|---|---|---|
9.00 ± 0.05 | EI | Thorstad, Undheim, et al., 1975 | LLK |
8.73 | PE | Treschanke and Rademacher, 1985 | Vertical value; LBLHLM |

References

Kozina and Skuratov, 1959
Kozina, M.P.; Skuratov, S.M.,
The enthalphy of polymerization of N-substituted lactames,
Dokl. Akad. Nauk SSSR, 1959, 127, 561-563. [all data]
Skuratov, Kozina, et al., 1958
Skuratov, S.M.; Kozina, M.P.; Shtocher, S.M.; Prevalova, N.M.; Kamkina, L.S.; Zuko, V.D.,
Heats of combustion of cyclic compounds,
Bull. Chem. Thermodyn., 1958, 1, 21. [all data]
Aldrich Chemical Company Inc., 1990
Aldrich Chemical Company Inc.,
Catalog Handbook of Fine Chemicals, Aldrich Chemical Company, Inc., Milwaukee WI, 1990, 1. [all data]
Shcherbina, Kaporovskii, et al., 1984
Shcherbina, A.E.; Kaporovskii, L.M.; Shcherbina, E.A.,
Zh. Prikl. Khim. (Leningrad), 1984, 57, 1910. [all data]
Thorstad, Undheim, et al., 1975
Thorstad, O.; Undheim, K.; El-Gendy, M.A.F.,
Ionisation potentials in structure analysis of isomeric nitrones, oxaziranes, O-ether oximes acid amides,
Org. Mass Spectrom., 1975, 10, 1155. [all data]
Treschanke and Rademacher, 1985
Treschanke, L.; Rademacher, P.,
Electronic structure and conformational properties of the amide linkage,
J. Mol. Struct., 1985, 122, 47. [all data]