Benzenamine,4-(phenylazo)-(E)-
- Formula: C12H11N3
- Molecular weight: 197.2358
- IUPAC Standard InChIKey: QPQKUYVSJWQSDY-CCEZHUSRSA-N
- CAS Registry Number: 25548-34-9
- Chemical structure:
View 3d structure (requires JavaScript / HTML 5) - Stereoisomers:

Gas phase ion energetics data

Data compiled by: Sharon G. Lias, Rhoda D. Levin, and Sherif A. Kafafi
Ionization energy determinations
IE (eV) | Method | Reference | Comment |
---|---|---|---|
7.67 ± 0.05 | PE | Millefiori, Millefiori, et al., 1979 | Vertical value |

References

Millefiori, Millefiori, et al., 1979
Millefiori, S.; Millefiori, A.; Pignataro, S.; Distefano, G.; Colonna, F.P.,
Gas phase UPS investigation of trans-azobenzenes,
Z. Naturforsch. A:, 1979, 34, 1496. [all data]