Terbium dichloride
- Formula: Cl2Tb
- Molecular weight: 229.831
- CAS Registry Number: 25469-96-9

Gas phase ion energetics data

Data compiled by: Sharon G. Lias, John E. Bartmess, Joel F. Liebman, John L. Holmes, Rhoda D. Levin, and W. Gary Mallard
Appearance energy determinations
Ion | AE (eV) | Other Products | Method | Reference | Comment |
---|---|---|---|---|---|
Tb+ | 15.59 ± 0.08 | 2Cl | EI | Sapegin, Baluev, et al., 1984 |

References

Sapegin, Baluev, et al., 1984
Sapegin, A.M.; Baluev, A.V.; Evdokimov, V.I.,
Mass-spectrometric investigation of the thermochemistry of the chlorides of the lanthanides,
Russ. J. Phys. Chem., 1984, 58, 1792. [all data]