Formothion
- Formula: C6H12NO4PS2
- Molecular weight: 257.268
- IUPAC Standard InChIKey: AIKKULXCBHRFOS-UHFFFAOYSA-N
- CAS Registry Number: 2540-82-1
- Chemical structure:
View 3d structure (requires JavaScript / HTML 5) - Other names: Phosphorodithioic acid, S-[2-(formylmethylamino)-2-oxoethyl] O,O-dimethyl ester; Phosphorodithioic acid, O,O-dimethyl ester, S-ester with N-formyl-2-mercapto-N-methylacetamide; Aflix; Anthio; Anthio 25; CP 53926; ENT 27,257; O,O-Dimethyl Dithiophosphorylacetic acid N-methyl-N-formylamide; S 6900; Toprose; S-(N-Formyl-N-methylcarbamoylmethyl) O,O-dimethyl phosphorodithioate; Acetamide, N-formyl-2-mercapto-N-methyl-, S-ester with O,O-dimethyl phosphorodithioate; Antio; O,O-Dimethyl S-(N-formyl-N-methylcarbamoylmethyl) phosphorodithioate; O,O-Dimethyl-S-(3-methyl-2,4-dioxo-3-azabutyl)dithiofosfaat; O,O-Dimethyl-S-(3-methyl-2,4-dioxo-3-azabutyl)dithiophosphat; O,O-Dimethyl-S-(N-methyl-N-formylcarbamoylmethyl)dithiophosphat; O,O-Dimethyl S-(N-methyl-N-formylcarbamoylmethyl)phosphorodithioate; O,O-Dimethyl phosphorodithioate N-formyl-2-mercapto-N-methylacetamide S-ester; O,O-Dimetil-S-(N-formil-N-metilcarbamoilmetil)ditiofosfato; S-(2-(Formylmethylamino)-2-oxoethyl) O,O-dimethylphosphorodithioate; N-Formyl-N-methylcarbamoylmethyl O,O-dimethyl phosphorodithioate; S-(N-Formyl-N-methylcarbamoylmethyl) dimethyl phosphorothiolothionate; J-38; OMS-968; Phosphorodithioic acid, O,O-dimethyl ester, N-formyl-2-mercapto-N-methylacetamide S-ester; Sandoz S-6900; SAN 244 I; SAN 6913 I; SAN 7107 I; Spencer S-6900; VEL 4284; Phosphorodithioic acid, o,o-dimethyl ester, s-ester with n-formyl-n-methylglycolamide

Normal alkane RI, non-polar column, isothermal

Column type | Active phase | Temperature (C) | I | Reference | Comment |
---|---|---|---|---|---|
Packed | OV-1 | 190. | 1805. | TSunoda, 1986 | Helium, Chromosorb W AW DMCS; Column length: 1. m |

Normal alkane RI, non-polar column, temperature ramp

Column type | Active phase | I | Reference | Comment |
---|---|---|---|---|
Packed | OV-1 | 1795. | TSunoda, 1986 | Helium, Chromosorb W AW DMCS, 4. K/min, 210. C @ 20. min; Column length: 1. m; Tstart: 140. C |

Normal alkane RI, non-polar column, custom temperature program

Column type | Active phase | I | Reference | Comment |
---|---|---|---|---|
Capillary | Ultra-1 | 1762. | Tameo and Kiyos, 1991 | Program: not specified |

References

TSunoda, 1986
TSunoda, N.,
Simultaneous determination of organophosphorous pesticides in forencis chemistry by gas-liquid chromatography with hydrogen flame ionization detector,
Eisei Kagaku, 1986, 32, 2, 91-100, https://doi.org/10.1248/jhs1956.32.91
. [all data]
Tameo and Kiyos, 1991
Tameo, O.; Kiyos, I.,
Simultaneous determination of pesticides by capillary gas chromatography,
Cannot be traslated (in Japan), 1991, 14, 2, 109-122. [all data]