6,19-Methanobenzocyclooctadecen-21-one,
- Formula: C23H30O
- Molecular weight: 322.4837
- IUPAC Standard InChIKey: LRURKHXGUOCKOP-UHFFFAOYSA-N
- CAS Registry Number: 25401-43-8
- Chemical structure:
View 3d structure (requires JavaScript / HTML 5) - Permanent link for this species. Use this link for bookmarking this species for future reference.

Gas phase thermochemistry data

Data compiled by: Hussein Y. Afeefy, Joel F. Liebman, and Stephen E. Stein
Quantity | Value | Units | Method | Reference | Comment |
---|---|---|---|---|---|
ΔfH°gas | -160. ± 15. | kJ/mol | Ccb | Schmid, Kloster-Jensen, et al., 1956 | Reanalyzed by Cox and Pilcher, 1970, Original value = -172. kJ/mol |

Condensed phase thermochemistry data

Data compiled by: Hussein Y. Afeefy, Joel F. Liebman, and Stephen E. Stein
Quantity | Value | Units | Method | Reference | Comment |
---|---|---|---|---|---|
ΔfH°solid | -263. ± 11. | kJ/mol | Ccb | Schmid, Kloster-Jensen, et al., 1956 | Reanalyzed by Cox and Pilcher, 1970, Original value = -253. ± 11. kJ/mol |
Quantity | Value | Units | Method | Reference | Comment |
ΔcH°solid | -13075. ± 11. | kJ/mol | Ccb | Schmid, Kloster-Jensen, et al., 1956 | Reanalyzed by Cox and Pilcher, 1970, Original value = -13086. ± 11. kJ/mol; Corresponding ΔfHºsolid = -263.2 kJ/mol (simple calculation by NIST; no Washburn corrections) |

Gas phase ion energetics data

Data compiled as indicated in comments:
LLK - Sharon G. Lias, Rhoda D. Levin, and Sherif A. Kafafi
Ionization energy determinations
IE (eV) | Method | Reference | Comment |
---|---|---|---|
8.15 ± 0.03 | PE | Allan, Heilbronner, et al., 1975 | Vertical value; LLK |

References

Schmid, Kloster-Jensen, et al., 1956
Schmid, R.W.; Kloster-Jensen, E.; Kovats, E.; Heilbronner, E.,
96. Untersuchungen in der benztropylium-reihe. IV. Die bildungsenthalpien des 2,7-dimethyl-4,5-benztropons, des 2,7-dodecamethylen-4,5-benztropons und des 2,7-penta-methylen-4,5-benztropons,
Helv. Chim. Acta, 1956, 39, 806-812. [all data]
Cox and Pilcher, 1970
Cox, J.D.; Pilcher, G.,
Thermochemistry of Organic and Organometallic Compounds, Academic Press, New York, 1970, 1-636. [all data]
Allan, Heilbronner, et al., 1975
Allan, M.; Heilbronner, E.; Kloster-Jensen, E.,
A photoelectron-spectroscopic investigation of benzologue tropones,
J. Electron Spectrosc. Relat. Phenom., 1975, 6, 181. [all data]