Quinazoline
- Formula: C8H6N2
- Molecular weight: 130.1466
- IUPAC Standard InChIKey: JWVCLYRUEFBMGU-UHFFFAOYSA-N
- CAS Registry Number: 253-82-7
- Chemical structure:
View 3d structure (requires JavaScript / HTML 5) - Other names: Phenmiazine; 1,3-Benzodiazine; 1,3-Diazanaphthalene; 4.5-Benzopyrimidine; Benzo(e)pyrimidine

Gas phase thermochemistry data

Data compiled by: Hussein Y. Afeefy, Joel F. Liebman, and Stephen E. Stein
Quantity | Value | Units | Method | Reference | Comment |
---|---|---|---|---|---|
ΔfH°gas | 243.1 ± 2.7 | kJ/mol | Ccb | Ribeiro da Silva and Matos, 1995 | |
ΔfH°gas | 258.6 ± 8.8 | kJ/mol | Ccb | Hussein and Akasheh, 1985 |

Condensed phase thermochemistry data

Data compiled by: Hussein Y. Afeefy, Joel F. Liebman, and Stephen E. Stein
Quantity | Value | Units | Method | Reference | Comment |
---|---|---|---|---|---|
ΔfH°solid | 166.5 ± 2.3 | kJ/mol | Ccb | Ribeiro da Silva and Matos, 1995 | |
ΔfH°solid | 180.3 ± 8.8 | kJ/mol | Ccb | Hussein and Akasheh, 1985 | |
Quantity | Value | Units | Method | Reference | Comment |
ΔcH°solid | -4172.0 ± 2.1 | kJ/mol | Ccb | Ribeiro da Silva and Matos, 1995 | |
ΔcH°solid | -4185.8 ± 8.1 | kJ/mol | Ccb | Hussein and Akasheh, 1985 |

Phase change data

Data compiled as indicated in comments:
BS - Robert L. Brown and Stephen E. Stein
TRC - Thermodynamics Research Center, NIST Boulder Laboratories, Chris Muzny director
AC - William E. Acree, Jr., James S. Chickos
ALS - Hussein Y. Afeefy, Joel F. Liebman, and Stephen E. Stein
DRB - Donald R. Burgess, Jr.
DH - Eugene S. Domalski and Elizabeth D. Hearing
Quantity | Value | Units | Method | Reference | Comment |
---|---|---|---|---|---|
Tboil | 516.2 | K | N/A | Aldrich Chemical Company Inc., 1990 | BS |
Quantity | Value | Units | Method | Reference | Comment |
Tfus | 321. | K | N/A | Sabbah and Pemenzi, 1993 | Uncertainty assigned by TRC = 0.1 K; TRC |
Quantity | Value | Units | Method | Reference | Comment |
ΔvapH° | 58.9 ± 2.0 | kJ/mol | CGC | Lipkind, Hanshaw, et al., 2009 | AC |
Quantity | Value | Units | Method | Reference | Comment |
ΔsubH° | 77. ± 2. | kJ/mol | AVG | N/A | Average of 6 values; Individual data points |
Enthalpy of sublimation
ΔsubH (kJ/mol) | Temperature (K) | Reference | Comment |
---|---|---|---|
77.590 | 298.15 | Sabbah and Pemenzi, 1993, 2 | DH |
Enthalpy of fusion
ΔfusH (kJ/mol) | Temperature (K) | Reference | Comment |
---|---|---|---|
16.95 | 320.9 | Sabbah and Pemenzi, 1993 | AC |
Temperature of phase transition
Ttrs (K) | Initial Phase | Final Phase | Reference | Comment |
---|---|---|---|---|
320.82 | crystaline | liquid | Sabbah and Pemenzi, 1993, 2 | DH |

Gas phase ion energetics data

Data evaluated as indicated in comments:
L - Sharon G. Lias
Data compiled as indicated in comments:
LLK - Sharon G. Lias, Rhoda D. Levin, and Sherif A. Kafafi
RDSH - Henry M. Rosenstock, Keith Draxl, Bruce W. Steiner, and John T. Herron
B - John E. Bartmess
Quantity | Value | Units | Method | Reference | Comment |
---|---|---|---|---|---|
IE (evaluated) | 9.03 ± 0.03 | eV | N/A | N/A | L |
Electron affinity determinations
EA (eV) | Method | Reference | Comment |
---|---|---|---|
0.58 ± 0.10 | IMRE | Dillow and Kebarle, 1989 | ΔGea(423 K)= -12.7 kcal/mol; ΔSea = -1.5,taken as that of anthracene, from Kebarle and Chowdhury, 1987. 1,3-diazanaphthalene.; B |
Ionization energy determinations
IE (eV) | Method | Reference | Comment |
---|---|---|---|
9.00 ± 0.02 | PE | Brogli, Heilbronner, et al., 1972 | LLK |
9.02 | PE | Dewar and Worley, 1969 | RDSH |
9.08 | PE | Van Den Ham and Van Der Meer, 1972 | Vertical value; LLK |

Van Den Dool and Kratz RI, non-polar column, temperature ramp

Column type | Active phase | I | Reference | Comment |
---|---|---|---|---|
Capillary | BPX-5 | 1239. | Ames, Defaye, et al., 1997 | 50. m/0.325 mm/0.5 μm, He, 50. C @ 2. min, 4. K/min, 250. C @ 10. min |

Normal alkane RI, non-polar column, temperature ramp

Column type | Active phase | I | Reference | Comment |
---|---|---|---|---|
Capillary | Ultra-1 | 1201. | Okumura, 1991 | 25. m/0.32 mm/0.25 μm, He, 3. K/min; Tstart: 80. C; Tend: 260. C |

References

Ribeiro da Silva and Matos, 1995
Ribeiro da Silva, M.A.V.; Matos, M.A.R.,
Thermochemical and theoretical studies of some benzodiazines,
J. Chem. Soc. Faraday Trans., 1995, 91, 1907-1910. [all data]
Hussein and Akasheh, 1985
Hussein, A.; Akasheh, T.S.,
Heat of combustion of heterocyclic compounds. Part II.,
Dirasat - Univ. Jordan, 1985, 12, 65-72. [all data]
Aldrich Chemical Company Inc., 1990
Aldrich Chemical Company Inc.,
Catalog Handbook of Fine Chemicals, Aldrich Chemical Company, Inc., Milwaukee WI, 1990, 1. [all data]
Sabbah and Pemenzi, 1993
Sabbah, R.; Pemenzi, O.,
Energetics of intermolecular bonds in the three diazines: phthalazine, quinazoline and quinoxaline,
C. R. Acad. Sci. Paris, Ser. II, 1993, 317, 5, 575. [all data]
Lipkind, Hanshaw, et al., 2009
Lipkind, Dmitri; Hanshaw, William; Chickos, James S.,
Hypothetical Thermodynamic Properties. Subcooled Vaporization Enthalpies and Vapor Pressures of Polyaromatic Heterocycles and Related Compounds,
J. Chem. Eng. Data, 2009, 54, 10, 2930-2943, https://doi.org/10.1021/je900034d
. [all data]
Sabbah and Pemenzi, 1993, 2
Sabbah, R.; Pemenzi, O.,
Energetique des liaisons intermoleculaires dans les molecules de phthalazine, quinazoline, and quinoxaline, Compt. Rend. Acad. Sci. Paris,
Series II, 1993, 317, 575-581. [all data]
Dillow and Kebarle, 1989
Dillow, G.W.; Kebarle, P.,
Electron Affinities of aza-substituted polycyclic aromatic hydrocarbons,
Can. J. Chem., 1989, 67, 10, 1628, https://doi.org/10.1139/v89-249
. [all data]
Kebarle and Chowdhury, 1987
Kebarle, P.; Chowdhury, S.,
Electron affinities and electron transfer reactions,
Chem. Rev., 1987, 87, 513. [all data]
Brogli, Heilbronner, et al., 1972
Brogli, F.; Heilbronner, E.; Kobayashi, T.,
Photoelectron spectra of azabenzenes and azanaphthalenes: II. A reinvestigation of azanaphthalenes by high-resolution photoelectron spectroscopy,
Helv. Chim. Acta, 1972, 55, 274. [all data]
Dewar and Worley, 1969
Dewar, M.J.S.; Worley, S.D.,
Photoelectron spectra of molecules. II.The ionization potentials of azabenzenes and azanaphthalenes,
J. Chem. Phys., 1969, 51, 263. [all data]
Van Den Ham and Van Der Meer, 1972
Van Den Ham, D.M.W.; Van Der Meer, D.,
The photoelectron spectra of the diazanaphthalenes,
Chem. Phys. Lett., 1972, 12, 447. [all data]
Vanderhaegte and Claesen, 1957
Vanderhaegte, H.; Claesen, M.,
Bull. soc. chim. Belges, 1957, 66, 276. [all data]
Ames, Defaye, et al., 1997
Ames, J.M.; Defaye, A.B.; Bates, L.,
The effect of pH on the volatiles formed in an extruded starch-glucose-lysine model system,
Food Chem., 1997, 58, 4, 323-327, https://doi.org/10.1016/S0308-8146(96)00171-9
. [all data]
Okumura, 1991
Okumura, T.,
retention indices of environmental chemicals on methyl silicone capillary column,
Journal of Environmental Chemistry (Japan), 1991, 1, 2, 333-358, https://doi.org/10.5985/jec.1.333
. [all data]