Cinnoline
- Formula: C8H6N2
- Molecular weight: 130.1466
- IUPAC Standard InChIKey: WCZVZNOTHYJIEI-UHFFFAOYSA-N
- CAS Registry Number: 253-66-7
- Chemical structure:
View 3d structure (requires JavaScript / HTML 5) - Other names: Benzo[c]pyridazine; α-Phenodiazine; 1,2-Benzodiazine; 1,2-Diazanaphthalene

Phase change data

Data compiled by: Robert L. Brown and Stephen E. Stein
Reduced pressure boiling point
Tboil (K) | Pressure (bar) | Reference |
---|---|---|
387.2 | 0.0004 | Weast and Grasselli, 1989 |

Gas phase ion energetics data

Data evaluated as indicated in comments:
HL - Edward P. Hunter and Sharon G. Lias
Data compiled as indicated in comments:
LLK - Sharon G. Lias, Rhoda D. Levin, and Sherif A. Kafafi
RDSH - Henry M. Rosenstock, Keith Draxl, Bruce W. Steiner, and John T. Herron
B - John E. Bartmess
Quantity | Value | Units | Method | Reference | Comment |
---|---|---|---|---|---|
Proton affinity (review) | 936.3 | kJ/mol | N/A | Hunter and Lias, 1998 | HL |
Quantity | Value | Units | Method | Reference | Comment |
Gas basicity | 904.4 | kJ/mol | N/A | Hunter and Lias, 1998 | HL |
Electron affinity determinations
EA (eV) | Method | Reference | Comment |
---|---|---|---|
0.72 ± 0.10 | IMRE | Dillow and Kebarle, 1989 | ΔGea(423 K)= -16.0 kcal/mol; ΔSea=-1.5, taken as that of anthracene, from Kebarle and Chowdhury, 1987. 1,2-diazanaphthalene; B |
Ionization energy determinations
IE (eV) | Method | Reference | Comment |
---|---|---|---|
8.51 | PE | Dewar and Worley, 1969 | RDSH |
8.95 ± 0.01 | PI | Yencha and El-Sayed, 1968 | RDSH |
8.90 | PE | Van Den Ham and Van Der Meer, 1972 | Vertical value; LLK |
8.8 | PE | Brogli, Heilbronner, et al., 1972 | Vertical value; LLK |

References

Weast and Grasselli, 1989
CRC Handbook of Data on Organic Compounds, 2nd Editon, Weast,R.C and Grasselli, J.G., ed(s)., CRC Press, Inc., Boca Raton, FL, 1989, 1. [all data]
Hunter and Lias, 1998
Hunter, E.P.; Lias, S.G.,
Evaluated Gas Phase Basicities and Proton Affinities of Molecules: An Update,
J. Phys. Chem. Ref. Data, 1998, 27, 3, 413-656, https://doi.org/10.1063/1.556018
. [all data]
Dillow and Kebarle, 1989
Dillow, G.W.; Kebarle, P.,
Electron Affinities of aza-substituted polycyclic aromatic hydrocarbons,
Can. J. Chem., 1989, 67, 10, 1628, https://doi.org/10.1139/v89-249
. [all data]
Kebarle and Chowdhury, 1987
Kebarle, P.; Chowdhury, S.,
Electron affinities and electron transfer reactions,
Chem. Rev., 1987, 87, 513. [all data]
Dewar and Worley, 1969
Dewar, M.J.S.; Worley, S.D.,
Photoelectron spectra of molecules. II.The ionization potentials of azabenzenes and azanaphthalenes,
J. Chem. Phys., 1969, 51, 263. [all data]
Yencha and El-Sayed, 1968
Yencha, A.J.; El-Sayed, M.A.,
Lowest ionization potentials of some nitrogen heterocyclics,
J. Chem. Phys., 1968, 48, 3469. [all data]
Van Den Ham and Van Der Meer, 1972
Van Den Ham, D.M.W.; Van Der Meer, D.,
The photoelectron spectra of the diazanaphthalenes,
Chem. Phys. Lett., 1972, 12, 447. [all data]
Brogli, Heilbronner, et al., 1972
Brogli, F.; Heilbronner, E.; Kobayashi, T.,
Photoelectron spectra of azabenzenes and azanaphthalenes: II. A reinvestigation of azanaphthalenes by high-resolution photoelectron spectroscopy,
Helv. Chim. Acta, 1972, 55, 274. [all data]
Osborn and Schofield, 1956
Osborn, A.R.; Schofield, K.,
J. Chem. Soc., 1956, 4191. [all data]