Phthalazine
- Formula: C8H6N2
- Molecular weight: 130.1466
- IUPAC Standard InChIKey: LFSXCDWNBUNEEM-UHFFFAOYSA-N
- CAS Registry Number: 253-52-1
- Chemical structure:
View 3d structure (requires JavaScript / HTML 5) - Other names: Benzo[d]pyridazine; β-Phenodiazine; 2,3-Benzodiazine; 2,3-Diazanaphthalene

Gas phase thermochemistry data

Data compiled by: Hussein Y. Afeefy, Joel F. Liebman, and Stephen E. Stein
Quantity | Value | Units | Method | Reference | Comment |
---|---|---|---|---|---|
ΔfH°gas | 329.9 ± 3.3 | kJ/mol | Ccb | Ribeiro da Silva and Matos, 1995 | |
ΔfH°gas | 345. ± 18. | kJ/mol | Ccb | Hussein and Akasheh, 1985 |

Condensed phase thermochemistry data

Data compiled by: Hussein Y. Afeefy, Joel F. Liebman, and Stephen E. Stein
Quantity | Value | Units | Method | Reference | Comment |
---|---|---|---|---|---|
ΔfH°solid | 247.6 ± 2.3 | kJ/mol | Ccb | Ribeiro da Silva and Matos, 1995 | |
ΔfH°solid | 261. ± 17. | kJ/mol | Ccb | Hussein and Akasheh, 1985 | |
Quantity | Value | Units | Method | Reference | Comment |
ΔcH°solid | -4253.2 ± 2.1 | kJ/mol | Ccb | Ribeiro da Silva and Matos, 1995 | |
ΔcH°solid | -4267. ± 17. | kJ/mol | Ccb | Hussein and Akasheh, 1985 |

Phase change data

Data compiled as indicated in comments:
BS - Robert L. Brown and Stephen E. Stein
TRC - Thermodynamics Research Center, NIST Boulder Laboratories, Chris Muzny director
AC - William E. Acree, Jr., James S. Chickos
ALS - Hussein Y. Afeefy, Joel F. Liebman, and Stephen E. Stein
DRB - Donald R. Burgess, Jr.
DH - Eugene S. Domalski and Elizabeth D. Hearing
Quantity | Value | Units | Method | Reference | Comment |
---|---|---|---|---|---|
Tfus | 364. | K | N/A | Sabbah and Pemenzi, 1993 | Uncertainty assigned by TRC = 0.1 K; TRC |
Quantity | Value | Units | Method | Reference | Comment |
ΔsubH° | 83. ± 2. | kJ/mol | AVG | N/A | Average of 6 values; Individual data points |
Reduced pressure boiling point
Tboil (K) | Pressure (bar) | Reference | Comment |
---|---|---|---|
462.2 | 0.039 | Aldrich Chemical Company Inc., 1990 | BS |
448.2 | 0.023 | Weast and Grasselli, 1989 | BS |
Enthalpy of fusion
ΔfusH (kJ/mol) | Temperature (K) | Reference | Comment |
---|---|---|---|
13.32 | 364.5 | Sabbah and Pemenzi, 1993 | AC |
Temperature of phase transition
Ttrs (K) | Initial Phase | Final Phase | Reference | Comment |
---|---|---|---|---|
364.41 | crystaline | liquid | Sabbah and Pemenzi, 1993, 2 | DH |

Gas phase ion energetics data

Data compiled as indicated in comments:
LLK - Sharon G. Lias, Rhoda D. Levin, and Sherif A. Kafafi
RDSH - Henry M. Rosenstock, Keith Draxl, Bruce W. Steiner, and John T. Herron
Ionization energy determinations
IE (eV) | Method | Reference | Comment |
---|---|---|---|
8.4 | PE | Van Den Ham and Van Der Meer, 1972 | LLK |
8.68 | PE | Dewar and Worley, 1969 | RDSH |
9.22 ± 0.01 | PI | Yencha and El-Sayed, 1968 | RDSH |
8.70 | PE | Van Den Ham and Van Der Meer, 1972 | Vertical value; LLK |

Van Den Dool and Kratz RI, non-polar column, temperature ramp

Column type | Active phase | I | Reference | Comment |
---|---|---|---|---|
Packed | SE-30 | 1437. | Peng, Ding, et al., 1988 | He, Supelcoport and Chromosorb, 40. C @ 4. min, 10. K/min, 250. C @ 60. min; Column length: 3.05 m |

References

Ribeiro da Silva and Matos, 1995
Ribeiro da Silva, M.A.V.; Matos, M.A.R.,
Thermochemical and theoretical studies of some benzodiazines,
J. Chem. Soc. Faraday Trans., 1995, 91, 1907-1910. [all data]
Hussein and Akasheh, 1985
Hussein, A.; Akasheh, T.S.,
Heat of combustion of heterocyclic compounds. Part II.,
Dirasat - Univ. Jordan, 1985, 12, 65-72. [all data]
Sabbah and Pemenzi, 1993
Sabbah, R.; Pemenzi, O.,
Energetics of intermolecular bonds in the three diazines: phthalazine, quinazoline and quinoxaline,
C. R. Acad. Sci. Paris, Ser. II, 1993, 317, 5, 575. [all data]
Aldrich Chemical Company Inc., 1990
Aldrich Chemical Company Inc.,
Catalog Handbook of Fine Chemicals, Aldrich Chemical Company, Inc., Milwaukee WI, 1990, 1. [all data]
Weast and Grasselli, 1989
CRC Handbook of Data on Organic Compounds, 2nd Editon, Weast,R.C and Grasselli, J.G., ed(s)., CRC Press, Inc., Boca Raton, FL, 1989, 1. [all data]
Sabbah and Pemenzi, 1993, 2
Sabbah, R.; Pemenzi, O.,
Energetique des liaisons intermoleculaires dans les molecules de phthalazine, quinazoline, and quinoxaline, Compt. Rend. Acad. Sci. Paris,
Series II, 1993, 317, 575-581. [all data]
Van Den Ham and Van Der Meer, 1972
Van Den Ham, D.M.W.; Van Der Meer, D.,
The photoelectron spectra of the diazanaphthalenes,
Chem. Phys. Lett., 1972, 12, 447. [all data]
Dewar and Worley, 1969
Dewar, M.J.S.; Worley, S.D.,
Photoelectron spectra of molecules. II.The ionization potentials of azabenzenes and azanaphthalenes,
J. Chem. Phys., 1969, 51, 263. [all data]
Yencha and El-Sayed, 1968
Yencha, A.J.; El-Sayed, M.A.,
Lowest ionization potentials of some nitrogen heterocyclics,
J. Chem. Phys., 1968, 48, 3469. [all data]
Hirt and Caqvagnol, 1956
Hirt, R.C.; Caqvagnol, J.C.,
J. Chem. Phys., 1956, 25, 574. [all data]
Peng, Ding, et al., 1988
Peng, C.T.; Ding, S.F.; Hua, R.L.; Yang, Z.C.,
Prediction of Retention Indexes I. Structure-Retention Index Relationship on Apolar Columns,
J. Chromatogr., 1988, 436, 137-172, https://doi.org/10.1016/S0021-9673(00)94575-8
. [all data]