Phosphorochloridothioic acid, O,O-diethyl ester
- Formula: C4H10ClO2PS
- Molecular weight: 188.613
- IUPAC Standard InChIKey: KMJJJTCKNZYTEY-UHFFFAOYSA-N
- CAS Registry Number: 2524-04-1
- Chemical structure:
View 3d structure (requires JavaScript / HTML 5) - Other names: Diethoxythiophosphoryl chloride; Diethyl chlorothiophosphate; Diethyl phosphorochloridothioate; Diethyl phosphorochloridothionate; Diethyl phosphorochlorothioate; Diethyl phosphorothiochloridate; Diethyl thiophosphoric chloride; Diethyl thiophosphoryl chloride; Diethylthiophosphoric acid chloride; O,O-Diethyl chloridophosphorothioate; O,O-Diethyl chloridothionophosphate; O,O-Diethyl chlorothionophosphate; O,O-Diethyl chlorothiophosphate; O,O-Diethyl chlorothiophosphonate; O,O-Diethyl phosphorochloridothioate; O,O-Diethyl phosphorochlorothioate; O,O-Diethyl phosphorothiochloridate; O,O-Diethyl phosphorothionochloridate; O,O-Diethyl thionophosphoric acid ester chloride; O,O-Diethyl thionophosphoric chloride; O,O-Diethyl thionophosphoryl chloride; O,O-Diethyl thiophosphorochloridate; O,O-Diethyl thiophosphoryl chloride; O,O-Diethyl thiophosphoric acid chloride; Diethyl phosphorothionochloridate; Diethylchlorthiofosfat; Ethyl pct; O,O-Diethyl thionophosphorochloridate; O,O-Diethylester kyseliny chlorthiofosforecne; Phosphonothioic acid, chloro-, O,O-diethyl ester; UN 2751; O,O-Diethylchlorothiophosphidate; NSC 43776; Phosphorochloridothioic acid, o,o'-diethyl ester

Gas phase ion energetics data

Data compiled by: Sharon G. Lias, Rhoda D. Levin, and Sherif A. Kafafi
Ionization energy determinations
IE (eV) | Method | Reference | Comment |
---|---|---|---|
8.8 | PE | Chattorpadhyay, Findley, et al., 1981 | |
8.83 ± 0.02 | PE | Vilesov, Lopatin, et al., 1974 | |
9.31 | PE | Chattorpadhyay, Findley, et al., 1981 | Vertical value |
9.41 | PE | Zverev, Vilesov, et al., 1975 | Vertical value |
9.41 | PE | Vovna, Lopatin, et al., 1974 | Vertical value |

References

Chattorpadhyay, Findley, et al., 1981
Chattorpadhyay, S.; Findley, G.L.; McGlynn, S.P.,
Photoelectron spectroscopy of phosphites and phosphates,
J. Electron Spectrosc. Relat. Phenom., 1981, 24, 27. [all data]
Vilesov, Lopatin, et al., 1974
Vilesov, F.I.; Lopatin, S.N.; Vovna, V.I.; Paetzold, R.; Niendorf, K.,
Untersuchungen an molekulkomplexen. 3. Mitteilung: Zusammenhang zwischen der ionisierungsenergie von R1R2R3PS-molekulen und der stabilitat ihrer molekulkomplexe mit jod,
Z. Phys. Chem. (Leipzig), 1974, 255, 661. [all data]
Zverev, Vilesov, et al., 1975
Zverev, V.V.; Vilesov, F.I.; Vovna, V.I.; Lopatin, S.N.; Kitaev, Y.P.,
Photoelectron spectra,
Izv. Akad. Nauk SSSR, Ser. Khim., 1975, 1975, 1051. [all data]
Vovna, Lopatin, et al., 1974
Vovna, V.I.; Lopatin, S.N.; Pettsold, R.; Vilesov, F.I.; Akopyan, M.E.,
Photoelectron spectra of a number of substitution products of thiophosphoryl chloride,
Opt. Spectrosc., 1974, 36, 99. [all data]