Benzene, 1,3-dichloro-5-methyl-
- Formula: C7H6Cl2
- Molecular weight: 161.029
- IUPAC Standard InChIKey: RYMMNSVHOKXTNN-UHFFFAOYSA-N
- CAS Registry Number: 25186-47-4
- Chemical structure:
View 3d structure (requires JavaScript / HTML 5) - Other names: Toluene, 3,5-dichloro-; 3,5-Dichlorotoluene

Phase change data

Data compiled by: Robert L. Brown and Stephen E. Stein
Quantity | Value | Units | Method | Reference | Comment |
---|---|---|---|---|---|
Tboil | 474.7 | K | N/A | Weast and Grasselli, 1989 |

Gas phase ion energetics data

Data compiled by: Sharon G. Lias, Rhoda D. Levin, and Sherif A. Kafafi
Ionization energy determinations
IE (eV) | Method | Reference | Comment |
---|---|---|---|
9.99 ± 0.02 | PE | Maier, Marthaler, et al., 1980 | Vertical value |

References

Weast and Grasselli, 1989
CRC Handbook of Data on Organic Compounds, 2nd Editon, Weast,R.C and Grasselli, J.G., ed(s)., CRC Press, Inc., Boca Raton, FL, 1989, 1. [all data]
Maier, Marthaler, et al., 1980
Maier, J.P.; Marthaler, O.; Mohraz, M.,
Decay of some substituted benzene cations in the B states in the gaseous phase,
J. Chim. Phys., 1980, 77, 661. [all data]