1-Butanol, 3-methoxy-
- Formula: C5H12O2
- Molecular weight: 104.1476
- IUPAC Standard InChIKey: JSGVZVOGOQILFM-UHFFFAOYSA-N
- CAS Registry Number: 2517-43-3
- Chemical structure:
View 3d structure (requires JavaScript / HTML 5) - Other names: 3-Methoxy-1-butanol; 3-Methoxybutanol; Methoxybutanol; 3-methoxybutan-1-ol

Phase change data

Data compiled by: Thermodynamics Research Center, NIST Boulder Laboratories, Chris Muzny director
Quantity | Value | Units | Method | Reference | Comment |
---|---|---|---|---|---|
Tboil | 433. | K | N/A | Doering and Young, 1952 | Uncertainty assigned by TRC = 2. K |

Gas phase ion energetics data

Data compiled by: Sharon G. Lias and Joel F. Liebman
Appearance energy determinations
Ion | AE (eV) | Other Products | Method | Reference | Comment |
---|---|---|---|---|---|
C2H5O+ | 9.56 | C3H7O | EI | Holmes, Lossing, et al., 1991 |

Kovats' RI, non-polar column, isothermal

View large format table.

Column type Active phase Temperature (C) I Reference Comment
PackedApiezon L120.782.Bogoslovsky, Anvaer, et al., 1978Celite 545
PackedApiezon L160.790.Bogoslovsky, Anvaer, et al., 1978Celite 545

Van Den Dool and Kratz RI, non-polar column, custom temperature program

View large format table.

Column type Active phase I Reference Comment
PackedSE-30814.Peng, Ding, et al., 1988Supelcoport; Chromosorb; Column length: 3.05 m; Program: 40C(5min) => 10C/min => 200C or 250C (60min)

References

Doering and Young, 1952
Doering, W. vonE.; Young, R.W.,
Configurational Interrelationships of Some Secondary Carbinols,
J. Am. Chem. Soc., 1952, 74, 2997-9. [all data]
Holmes, Lossing, et al., 1991
Holmes, J.L.; Lossing, F.P.; Mayer, P.M.,
Heats of formation of oxygen-containing organic free radicals from appearance energy measurements,
J. Am. Chem. Soc., 1991, 113, 9723. [all data]