Cyclobutylamine
- Formula: C4H9N
- Molecular weight: 71.1210
- IUPAC Standard InChIKey: KZZKOVLJUKWSKX-UHFFFAOYSA-N
- CAS Registry Number: 2516-34-9
- Chemical structure:
View 3d structure (requires JavaScript / HTML 5) - Other names: Aminocyclobutane; Cyclobutanamine

Gas phase thermochemistry data

Data compiled by: Hussein Y. Afeefy, Joel F. Liebman, and Stephen E. Stein
Quantity | Value | Units | Method | Reference | Comment |
---|---|---|---|---|---|
ΔfH°gas | 41. ± 0.4 | kJ/mol | Ccb | Good, Messerly, et al., 1975 |

Condensed phase thermochemistry data

Data compiled by: Hussein Y. Afeefy, Joel F. Liebman, and Stephen E. Stein
Quantity | Value | Units | Method | Reference | Comment |
---|---|---|---|---|---|
ΔfH°liquid | 5.61 ± 0.59 | kJ/mol | Ccb | Good, Messerly, et al., 1975 | |
Quantity | Value | Units | Method | Reference | Comment |
ΔcH°liquid | -2865.9 ± 0.54 | kJ/mol | Ccb | Good, Messerly, et al., 1975 |

Phase change data

Data compiled as indicated in comments:
BS - Robert L. Brown and Stephen E. Stein
ALS - Hussein Y. Afeefy, Joel F. Liebman, and Stephen E. Stein
DRB - Donald R. Burgess, Jr.
Quantity | Value | Units | Method | Reference | Comment |
---|---|---|---|---|---|
Tboil | 355.2 | K | N/A | Weast and Grasselli, 1989 | BS |
Tboil | 355. | K | N/A | American Tokyo Kasei, 1988 | BS |
Quantity | Value | Units | Method | Reference | Comment |
ΔvapH° | 36. ± 0.4 | kJ/mol | V | Good, Messerly, et al., 1975 | ALS |
ΔvapH° | 35.4 | kJ/mol | N/A | Good, Messerly, et al., 1975 | DRB |
Reduced pressure boiling point
Tboil (K) | Pressure (bar) | Reference | Comment |
---|---|---|---|
354.7 | 1.00 | Aldrich Chemical Company Inc., 1990 | BS |

Gas phase ion energetics data

Data compiled by: Sharon G. Lias and Joel F. Liebman
Ionization energy determinations
IE (eV) | Method | Reference |
---|---|---|
8.60 ± 0.03 | PI | Bouchoux, Alcaraz, et al., 1994 |
8.75 ± 0.03 | PI | Bouchoux, Alcaraz, et al., 1994 |

References

Good, Messerly, et al., 1975
Good, W.D.; Messerly, J.F.; Osborn, A.G.; Douslin, D.R.,
Enthalpies of formation of cyclopentylamine and cyclobutylamine; vapor pressure of cyclopentylamine,
J. Chem. Thermodyn., 1975, 7, 285-291. [all data]
Weast and Grasselli, 1989
CRC Handbook of Data on Organic Compounds, 2nd Editon, Weast,R.C and Grasselli, J.G., ed(s)., CRC Press, Inc., Boca Raton, FL, 1989, 1. [all data]
American Tokyo Kasei, 1988
American Tokyo Kasei,
TCI American Organic Chemical 88/89 Catalog, American Tokyo Kasei, Portland, OR, 1988, 1610. [all data]
Aldrich Chemical Company Inc., 1990
Aldrich Chemical Company Inc.,
Catalog Handbook of Fine Chemicals, Aldrich Chemical Company, Inc., Milwaukee WI, 1990, 1. [all data]
Bouchoux, Alcaraz, et al., 1994
Bouchoux, G.; Alcaraz, C.; Dutuit, O.; Nguyen, M.T.,
A photoionization and molecular orbital study of cyclobutanol and cyclobutylamine radical cations,
Int. J. Mass Spectrom. Ion Processes, 1994, 137, 93. [all data]