Benzonitrile, 4-ethoxy-
- Formula: C9H9NO
- Molecular weight: 147.1739
- IUPAC Standard InChIKey: PJRLUGQMEZZDIY-UHFFFAOYSA-N
- CAS Registry Number: 25117-74-2
- Chemical structure:
View 3d structure (requires JavaScript / HTML 5) - Other names: Benzonitrile, p-ethoxy-; p-Ethoxybenzonitrile; 4-Ethoxybenzonitrile; 4-Ethoxybenzoic acid nitrile

Phase change data

Data compiled by: Robert L. Brown and Stephen E. Stein
Quantity | Value | Units | Method | Reference | Comment |
---|---|---|---|---|---|
Tboil | 531.2 | K | N/A | Weast and Grasselli, 1989 |

Gas phase ion energetics data

Data compiled by: Henry M. Rosenstock, Keith Draxl, Bruce W. Steiner, and John T. Herron
Ionization energy determinations
IE (eV) | Method | Reference |
---|---|---|
8.89 ± 0.15 | EI | McLafferty and Schiff, 1969 |
Appearance energy determinations
Ion | AE (eV) | Other Products | Method | Reference | Comment |
---|---|---|---|---|---|
C7H5NO+ | 11.19 ± 0.15 | C2H4 | EI | McLafferty and Schiff, 1969 |

References

Weast and Grasselli, 1989
CRC Handbook of Data on Organic Compounds, 2nd Editon, Weast,R.C and Grasselli, J.G., ed(s)., CRC Press, Inc., Boca Raton, FL, 1989, 1. [all data]
McLafferty and Schiff, 1969
McLafferty, F.W.; Schiff, L.J.,
The structure of [YC6H5O]+ ions in the spectra of aryl alkyl ethers,
Org. Mass Spectrom., 1969, 2, 757. [all data]