2-Selenophenecarboxaldehyde
- Formula: C5H4OSe
- Molecular weight: 159.04
- IUPAC Standard InChIKey: AGBORNIRMFZCGC-UHFFFAOYSA-N
- CAS Registry Number: 25109-26-6
- Chemical structure:
View 3d structure (requires JavaScript / HTML 5) - Permanent link for this species. Use this link for bookmarking this species for future reference.

Gas phase ion energetics data

Data compiled as indicated in comments:
LBLHLM - Sharon G. Lias, John E. Bartmess, Joel F. Liebman, John L. Holmes, Rhoda D. Levin, and W. Gary Mallard
LLK - Sharon G. Lias, Rhoda D. Levin, and Sherif A. Kafafi
Ionization energy determinations
IE (eV) | Method | Reference | Comment |
---|---|---|---|
9.091 | PE | Reineck, Nohre, et al., 1983 | LBLHLM |
9.47 ± 0.05 | EI | Linda, Marino, et al., 1971 | LLK |

References

Reineck, Nohre, et al., 1983
Reineck, I.; Nohre, C.; Lodin, P.; Maripuu, R.; Lindberg, B.; Karlsson, L.; Siegbahn, K.; Hornfeldt, A.-B.; Gronowitz, S.,
Electronic and vibrational structure of 2-substituted selenophenes studied by He(I) photoelectron spectroscopy,
Chem. Scr., 1983, 22, 209. [all data]
Linda, Marino, et al., 1971
Linda, P.; Marino, G.; Pignataro, S.,
A comparison of sensitivities to substituent effects of five- membered heteroaromatic rings in gas phase ionization,
J. Chem. Soc. B, 1971, 1585. [all data]