Naphthalene,1,2,3,4-tetrahydro-1-methylene-
- Formula: C11H12
- Molecular weight: 144.2130
- IUPAC Standard InChIKey: AUIURIPXSQBMJD-UHFFFAOYSA-N
- CAS Registry Number: 25108-63-8
- Chemical structure:
View 3d structure (requires JavaScript / HTML 5) - Species with the same structure:

Gas phase ion energetics data

Data compiled by: Sharon G. Lias, Rhoda D. Levin, and Sherif A. Kafafi
Ionization energy determinations
IE (eV) | Method | Reference | Comment |
---|---|---|---|
7.90 ± 0.02 | PE | Maier and Turner, 1973 | Vertical value |

References

Maier and Turner, 1973
Maier, J.P.; Turner, D.W.,
Steric inhibition of resonance studied by molecular photoelectron spectroscopy. Part 2. Phenylethylenes,
J. Chem. Soc. Faraday Trans. 2, 1973, 69, 196. [all data]