2-(chloromethyl)naphthalene
- Formula: C11H9Cl
- Molecular weight: 176.642
- IUPAC Standard InChIKey: MPCHQYWZAVTABQ-UHFFFAOYSA-N
- CAS Registry Number: 2506-41-4
- Chemical structure:
View 3d structure (requires JavaScript / HTML 5) - Other names: Naphthalene, 2-(chloromethyl)-

Phase change data

Data compiled by: Robert L. Brown and Stephen E. Stein
Reduced pressure boiling point
Tboil (K) | Pressure (bar) | Reference |
---|---|---|
443.2 | 0.027 | Weast and Grasselli, 1989 |

Gas phase ion energetics data

Data compiled by: Sharon G. Lias, Rhoda D. Levin, and Sherif A. Kafafi
Appearance energy determinations
Ion | AE (eV) | Other Products | Method | Reference | Comment |
---|---|---|---|---|---|
C11H9+ | 11.15 ± 0.05 | ? | EI | Schwarz and Bohlmann, 1973 |

References

Weast and Grasselli, 1989
CRC Handbook of Data on Organic Compounds, 2nd Editon, Weast,R.C and Grasselli, J.G., ed(s)., CRC Press, Inc., Boca Raton, FL, 1989, 1. [all data]
Schwarz and Bohlmann, 1973
Schwarz, H.; Bohlmann, F.,
Elektronenstossinduzierte fragmentierung von acetylenverbindungen. VI. Struktur und bildungsenthalpie der ionen [C11H9]+ und [C9H7]+,
Org. Mass Spectrom., 1973, 7, 395. [all data]