Benz[a]anthracene, 3-methyl-
- Formula: C19H14
- Molecular weight: 242.3145
- IUPAC Standard InChIKey: VYZKVUIQCRWXJH-UHFFFAOYSA-N
- CAS Registry Number: 2498-75-1
- Chemical structure:
View 3d structure (requires JavaScript / HTML 5) - Other names: 3-Methylbenz[a]anthracene; 3'-Methyl-1,2-benzanthracene

Gas phase ion energetics data

Data compiled as indicated in comments:
LLK - Sharon G. Lias, Rhoda D. Levin, and Sherif A. Kafafi
RDSH - Henry M. Rosenstock, Keith Draxl, Bruce W. Steiner, and John T. Herron
Ionization energy determinations
IE (eV) | Method | Reference | Comment |
---|---|---|---|
7.43 | CTS | Birks and Stifkin, 1961 | RDSH |
7.29 ± 0.03 | PE | Akiyama, Harvey, et al., 1981 | Vertical value; LLK |

Lee's RI, non-polar column, temperature ramp

Column type | Active phase | I | Reference | Comment |
---|---|---|---|---|
Capillary | SE-52 | 416.63 | Lee, Vassilaros, et al., 1979 | 12. m/0.3 mm/0.34 μm, He, 2. K/min; Tstart: 50. C; Tend: 250. C |

Lee's RI, non-polar column, custom temperature program

Column type | Active phase | I | Reference | Comment |
---|---|---|---|---|
Capillary | HP-5MS | 416.17 | Wang, Li, et al., 2007 | 30. m/0.25 mm/0.25 μm, He; Program: 60C(2min) => 6C/min => 258C => 2C/min => 300C(4min) |
Capillary | HP-5MS | 416.17 | Wang, Li, et al., 2007, 2 | 30. m/0.25 mm/0.25 μm, He; Program: not specified |
Capillary | HP-5MS | 416.50 | Wang, Li, et al., 2007, 2 | 30. m/0.25 mm/0.25 μm, He; Program: not specified |
Capillary | HP-5 MS | 419.5 | Brack and Schirmer, 2003 | 30. m/0.25 mm/0.25 μm, Helium; Program: 70 0C 7 0C/min -> 280 0C (2 min) 7 0C/min -> 300 0C (2 min) |
Capillary | SE-52 | 416.63 | Shlyakhov, 1984 | Program: not specified |

References

Birks and Stifkin, 1961
Birks, J.B.; Stifkin, M.A.,
π-Electronic excitation and ionization energies of condensed ring aromatic hydrocarbons,
Nature, 1961, 191, 761. [all data]
Akiyama, Harvey, et al., 1981
Akiyama, I.; Harvey, R.G.; LeBreton, P.R.,
Ultraviolet photoelectron studies of methyl-substituted benz[a]anthracenes,
J. Am. Chem. Soc., 1981, 103, 6330. [all data]
Lee, Vassilaros, et al., 1979
Lee, M.L.; Vassilaros, D.L.; White, C.M.; Novotny, M.,
Retention Indices for Programmed-Temperature Capillary-Column Gas Chromatography of Polycyclic Aromatic Hydrocarbons,
Anal. Chem., 1979, 51, 6, 768-773, https://doi.org/10.1021/ac50042a043
. [all data]
Wang, Li, et al., 2007
Wang, Z.; Li, K.; Lambert, P.; Yang, C.,
Identification, characterization and quantitation of pyrogenic polycylic aromatic hydrocarbons and other organic compounds in tire fire products,
J. Chromatogr. A, 2007, 1139, 1, 14-26, https://doi.org/10.1016/j.chroma.2006.10.085
. [all data]
Wang, Li, et al., 2007, 2
Wang, Z.; Li, K.; Lambert, P.; Brown, C.E.; Yang, C.; Hollebone, B.P.,
Identification and characterization of polycyclic aromatic compounds in tire fire products and differentiation of pyrogenic PAHs from petrogenic PAHs
in Proceedings of the 30th Arctic and Marine Oilspill (AMOP) Technical Seminar. Vol.1, 2007, 61-85. [all data]
Brack and Schirmer, 2003
Brack, W.; Schirmer, K.,
Effect-directed identification of oxygen and sulfur heterocycles as major polycyclic aromatic cytochrome P4501A-inducers in a contaminated sedimet,
Environ. Sci. Technol., 2003, 37, 14, 3062-3070, https://doi.org/10.1021/es020248j
. [all data]
Shlyakhov, 1984
Shlyakhov, A.F.,
Gas chromatography in organic geochemistry, Nedra, Moscow, 1984, 221. [all data]