4-Hexen-3-one
- Formula: C6H10O
- Molecular weight: 98.1430
- IUPAC Standard InChIKey: FEWIGMWODIRUJM-HWKANZROSA-N
- CAS Registry Number: 2497-21-4
- Chemical structure:
View 3d structure (requires JavaScript / HTML 5) - Other names: 2-Hexen-4-one; (E)-CH3CH=CHC(=O)C2H5; 2-Hexene-4-one; hex-4-en-3-one

Gas phase ion energetics data

Data compiled as indicated in comments:
LLK - Sharon G. Lias, Rhoda D. Levin, and Sherif A. Kafafi
Ionization energy determinations
IE (eV) | Method | Reference | Comment |
---|---|---|---|
9.32 | PE | Masclet and Mouvier, 1978 | LLK |

Van Den Dool and Kratz RI, polar column, custom temperature program

Column type | Active phase | I | Reference | Comment |
---|---|---|---|---|
Capillary | Supelcowax-10 | 1195. | Bianchi, Careri, et al., 2007 | 30. m/0.25 mm/0.25 μm, He; Program: 35C(8min) => 4C/min => 60C => 6C/min => 160C => 20C/min => 200C(1min) |

Normal alkane RI, non-polar column, temperature ramp

Column type | Active phase | I | Reference | Comment |
---|---|---|---|---|
Capillary | HP-5 MS | 855. | Sandoval-Montemayor, Garcia, et al., 2012 | 25. m/0.20 mm/0.30 μm, Helium, 40. C @ 2. min, 10. K/min, 260. C @ 20. min |

Normal alkane RI, polar column, custom temperature program

Column type | Active phase | I | Reference | Comment |
---|---|---|---|---|
Capillary | HP-Innowax | 1197. | Narain, Galvao, et al., 2007 | 30. m/0.25 mm/0.25 μm, He; Program: 30C(5min) => 7C/min => 100C(5min) => 1C/min => 130C => 10C/min => 195C(45min) |
Capillary | HP-Innowax | 1197. | Narain, Galvao, et al., 2007 | 30. m/0.25 mm/0.25 μm, He; Program: 30C(5min) => 7C/min => 100C(5min) => 1C/min => 130C => 10C/min => 195C(45min) |

References

Masclet and Mouvier, 1978
Masclet, P.; Mouvier, G.,
Etude par spectrometrie photoelectronique d'aldehydes et de cetones ethyleniques conjugues,
J. Electron Spectrosc. Relat. Phenom., 1978, 14, 77. [all data]
Bianchi, Careri, et al., 2007
Bianchi, F.; Careri, M.; Mangia, A.; Musci, M.,
Retention indices in the analysis of food aroma volatile compounds in temperature-programmed gas chromatography: Database creation and evaluation of precision and robustness,
J. Sep. Sci., 2007, 39, 4, 563-572, https://doi.org/10.1002/jssc.200600393
. [all data]
Sandoval-Montemayor, Garcia, et al., 2012
Sandoval-Montemayor, N.E.; Garcia, A.; Elizondo-Trevino, E.; Garza-Gonzales, E.; Alvarez, L.; Camacho-Corona, M. delR.,
Chemical composition of hexane extract of Citrus aurantifolia and anti-mycobacterium tuberculosis activity of some of its constituents,
Molecules, 2012, 17, 12, 11173-11184, https://doi.org/10.3390/molecules170911173
. [all data]
Narain, Galvao, et al., 2007
Narain, N.; Galvao, M.S.; Madruga, M.S.,
Volatile compounds captured through purge and trap technique in caja-umbu (Spondias sp.) fruits during maturation,
Food Chem., 2007, 102, 3, 726-731, https://doi.org/10.1016/j.foodchem.2006.06.003
. [all data]