Germylene
- Formula: GeH2
- Molecular weight: 74.66
- IUPAC Standard InChIKey: MWRNXFLKMVJUFL-UHFFFAOYSA-N
- CAS Registry Number: 24968-55-6
- Chemical structure:
View 3d structure (requires JavaScript / HTML 5) - Permanent link for this species. Use this link for bookmarking this species for future reference.

Reaction thermochemistry data

Data compiled by: José A. Martinho Simões
Individual Reactions
By formula: H3Ge (g) = H (g) + H2Ge (g)
Quantity | Value | Units | Method | Reference | Comment |
---|---|---|---|---|---|
ΔrH° | >236. | kJ/mol | PIMS | Ruscic, Schwarz, et al., 1990 | Temperature: 0 K. A value of 247. kJ/mol is recommended in Ruscic, Schwarz, et al., 1990. |
(g) = HGe (g) +
(g)
By formula: H2Ge (g) = HGe (g) + H (g)
Quantity | Value | Units | Method | Reference | Comment |
---|---|---|---|---|---|
ΔrH° | <288. | kJ/mol | PIMS | Ruscic, Schwarz, et al., 1990 | Temperature: 0 K. A value of 277. kJ/mol is recommended in Ruscic, Schwarz, et al., 1990. |

Gas phase ion energetics data

Data compiled as indicated in comments:
LL - Sharon G. Lias and Joel F. Liebman
B - John E. Bartmess
Electron affinity determinations
EA (eV) | Method | Reference | Comment |
---|---|---|---|
1.0970 ± 0.0027 | LPES | Miller, Miller, et al., 1986 | B |
Ionization energy determinations
IE (eV) | Method | Reference | Comment |
---|---|---|---|
≤9.25 | PI | Ruscic, Schwarz, et al., 1990 | LL |

Vibrational and/or electronic energy levels

Data compiled by: Marilyn E. Jacox
State: A
Energy (cm-1) |
Med. | Transition | λmin (nm) |
λmax (nm) |
References | ||
---|---|---|---|---|---|---|---|
To = 16325.54 | gas | A-X | 489 | 850 | Saito and Obi, 1993 | ||
Saito and Obi, 1994 | |||||||
Karolczak, Harper, et al., 1995 | |||||||
Campargue and Escribano, 1999 | |||||||
Smith, Clouthier, et al., 2000 | |||||||
Vib. sym. |
No. | Approximate type of mode |
cm-1 | Med. | Method | References | |
---|---|---|---|---|---|---|---|
a1 | 1 | Sym. stretch | 1798.4 | gas | LF | Karolczak, Harper, et al., 1995 | |
2 | Bend | 783.0 | gas | LF | Saito and Obi, 1993 Saito and Obi, 1994 Karolczak, Harper, et al., 1995 | ||
State: X
Vib. sym. |
No. | Approximate type of mode |
cm-1 | Med. | Method | References | |
---|---|---|---|---|---|---|---|
a1 | 1 | Sym. stretch | 1856 | gas | LF | Smith, Clouthier, et al., 2000 | |
1 | Sym. stretch | 1862.5 | Ne | IR | Wang, Andrews, et al., 2002 | ||
1 | Sym. stretch | 1860.4 | Ne | IR | Wang, Andrews, et al., 2002 | ||
1 | Sym. stretch | 1839.2 | Ar | IR | Wang, Andrews, et al., 2002 | ||
1 | Sym. stretch | 1858.5 | H2 | IR | Wang and Andrews, 2003 | ||
1 | Sym. stretch | 1854.5 | H2 | IR | Wang and Andrews, 2003 | ||
2 | Bend | 916 | gas | LF | Saito and Obi, 1993 Smith, Clouthier, et al., 2000 | ||
2 | Bend | 921.5 | Ne | IR | Wang, Andrews, et al., 2002 | ||
2 | Bend | 913.6 | Ar | IR | Wang, Andrews, et al., 2002 | ||
2 | Bend | 902.8 | H2 | IR | Wang and Andrews, 2003 | ||
b2 | 3 | Asym. stretch | 1862.5 | Ne | IR | Wang, Andrews, et al., 2002 | |
3 | Asym. stretch | 1860.4 | Ne | IR | Wang, Andrews, et al., 2002 | ||
3 | Asym. stretch | 1839.2 | Ar | IR | Wang, Andrews, et al., 2002 | ||
3 | Asym. stretch | 1858.5 | H2 | IR | Wang and Andrews, 2003 | ||
3 | Asym. stretch | 1854.5 | H2 | IR | Wang and Andrews, 2003 | ||
Additional references: Jacox, 1994, page 20; Jacox, 1998, page 132; Jacox, 2003, page 18; Smith and Guillory, 1972; Lloret, Oria, et al., 1991

References

Ruscic, Schwarz, et al., 1990
Ruscic, B.; Schwarz, M.; Berkowitz, J.,
Photoionization studies of GeHn(n = 2-4),
J. Chem. Phys., 1990, 92, 1865. [all data]
Miller, Miller, et al., 1986
Miller, T.M.; Miller, A.E.S.; Lineberger, W.C.,
Electron Affinities of Ge and Sn,
Phys. Rev. A, 1986, 33, 5, 3558, https://doi.org/10.1103/PhysRevA.33.3558
. [all data]