Ethenesulfenic acid
- Formula: C2H4OS
- Molecular weight: 76.118
- IUPAC Standard InChIKey: SLAWTOLLPNIOGD-UHFFFAOYSA-N
- CAS Registry Number: 2492-74-2
- Chemical structure:
View 3d structure (requires JavaScript / HTML 5) - Permanent link for this species. Use this link for bookmarking this species for future reference.

Gas phase ion energetics data

Data compiled by: Sharon G. Lias and Joel F. Liebman
Ionization energy determinations
IE (eV) | Method | Reference |
---|---|---|
8.70 ± 0.03 | EI | Turecek, Brabec, et al., 1988 |

References

Turecek, Brabec, et al., 1988
Turecek, F.; Brabec, L.; Vondrak, T.; Hanus, V.; Hajicek, J.; Havlas, Z.,
Sulfenic acids in the gas phase. Prepration, ionization energies and heats of gormation of methane-, ethene-, ethyne- and benzenesulfenic acid,
Collect. Czech. Chem. Commun., 1988, 53, 2140. [all data]