2,4-Dimethyl-2,4-pentanediol
- Formula: C7H16O2
- Molecular weight: 132.2007
- IUPAC Standard InChIKey: DBTGFWMBFZBBEF-UHFFFAOYSA-N
- CAS Registry Number: 24892-49-7
- Chemical structure:
View 3d structure (requires JavaScript / HTML 5) - Other names: 2,4-Dimethylpentane-2,4-diol

Gas phase ion energetics data

Data compiled by: Sharon G. Lias and Joel F. Liebman
Appearance energy determinations
Ion | AE (eV) | Other Products | Method | Reference | Comment |
---|---|---|---|---|---|
C4H9O+ | 9.40 | C3H7O | EI | Holmes, Lossing, et al., 1991 |

References

Holmes, Lossing, et al., 1991
Holmes, J.L.; Lossing, F.P.; Mayer, P.M.,
Heats of formation of oxygen-containing organic free radicals from appearance energy measurements,
J. Am. Chem. Soc., 1991, 113, 9723. [all data]