2-Pyridinylnitrene
- Formula: C5H4N2
- Molecular weight: 92.0987
- IUPAC Standard InChIKey: JGQBNAFULRKENS-UHFFFAOYSA-N
- CAS Registry Number: 24843-39-8
- Chemical structure:
View 3d structure (requires JavaScript / HTML 5) - Permanent link for this species. Use this link for bookmarking this species for future reference.

Gas phase ion energetics data

Data compiled by: Sharon G. Lias, John E. Bartmess, Joel F. Liebman, John L. Holmes, Rhoda D. Levin, and W. Gary Mallard
Ionization energy determinations
IE (eV) | Method | Reference |
---|---|---|
8.9 | PE | Guimon, Khayar, et al., 1982 |

References

Guimon, Khayar, et al., 1982
Guimon, C.; Khayar, S.; Pfister-Guillouzo, G.; Claramunt, R.M.; Elguero, J.,
A direct photoelectron spectroscopy study of the 1-azidopyridine pyrolysis,
Spectrosc. Lett., 1982, 15, 435. [all data]